View Issue Details

IDProjectCategoryView StatusLast Update
0000872bareos-corestorage daemonpublic2018-06-22 17:13
Reportertuxmaster Assigned To 
PrioritynormalSeverityblockReproducibilityalways
Status closedResolutionfixed 
PlatformX86_64OSFedoraOS Version27
Fixed in Version17.2.6 
Summary0000872: 17.2.3 build fails on Fedora 27 at compiling the cephfs plugin
DescriptionUnder Fedora 26 the compile process will work.
At 27 it will fails at the cephfs part with:
/builddir/build/BUILD/bareos-17.2.3/libtool --silent --tag=CXX --mode=compile /usr/lib64/ccache/g++ -fno-strict-aliasing -fno-exceptions -I. -I../.. -I../../incl
ude -I../../filed -c cephfs-fd.c
cephfs-fd.c: In function 'bRC get_next_file_to_backup(bpContext*)':
cephfs-fd.c:470:97: error: cannot convert 'stat*' to 'ceph_statx*' for argument '4' to 'int ceph_readdirplus_r(ceph_mount_info*, ceph_dir_result*, dirent*, ceph_st
atx*, unsigned int, unsigned int, Inode**)'
       status = ceph_readdirplus_r(p_ctx->cmount, p_ctx->cdir, &p_ctx->de, &p_ctx->statp, &stmask);
                                                                                                 ^
cephfs-fd.c:476:19: error: 'ceph_stat' was not declared in this scope
          status = ceph_stat(p_ctx->cmount, p_ctx->cwd, &p_ctx->statp);
                   ^~~~~~~~~
cephfs-fd.c:476:19: note: suggested alternative: 'ceph_statx'
          status = ceph_stat(p_ctx->cmount, p_ctx->cwd, &p_ctx->statp);
                   ^~~~~~~~~
                   ceph_statx
cephfs-fd.c: In function 'bool cephfs_makedirs(plugin_ctx*, const char*)':
cephfs-fd.c:1186:14: error: 'ceph_lstat' was not declared in this scope
          if (ceph_lstat(p_ctx->cmount, new_directory.c_str(), &st) != 0) {
              ^~~~~~~~~~
cephfs-fd.c:1186:14: note: suggested alternative: 'ceph_statx'
          if (ceph_lstat(p_ctx->cmount, new_directory.c_str(), &st) != 0) {
              ^~~~~~~~~~
              ceph_statx
cephfs-fd.c: In function 'bRC createFile(bpContext*, restore_pkt*)':
cephfs-fd.c:1243:13: error: 'ceph_lstat' was not declared in this scope
    status = ceph_lstat(p_ctx->cmount, rp->ofname, &st);
             ^~~~~~~~~~
cephfs-fd.c:1243:13: note: suggested alternative: 'ceph_statx'
    status = ceph_lstat(p_ctx->cmount, rp->ofname, &st);
             ^~~~~~~~~~
             ceph_statx
make[1]: *** [Makefile:161: cephfs-fd.lo] Error 1
make[1]: Leaving directory '/builddir/build/BUILD/bareos-17.2.3/src/plugins/filed'
TagsNo tags attached.
bareos-master: impactyes
bareos-master: actionfixed
bareos-19.2: impact
bareos-19.2: action
bareos-18.2: impact
bareos-18.2: action
bareos-17.2: impactyes
bareos-17.2: actionfixed
bareos-16.2: impact
bareos-16.2: action
bareos-15.2: impact
bareos-15.2: action
bareos-14.2: impact
bareos-14.2: action
bareos-13.2: impact
bareos-13.2: action
bareos-12.4: impact
bareos-12.4: action

Relationships

child of 0000916 closedjoergs Release bareos-17.2.6 

Activities

tuxmaster

tuxmaster

2017-11-04 17:46

reporter  

build.log (99,514 bytes)   
Mock Version: 1.4.6
ENTER ['do'](['bash', '--login', '-c', '/usr/bin/rpmbuild -bs --target x86_64 --nodeps /builddir/build/SPECS/bareos.spec'], chrootPath='/var/lib/mock/fedora-27-x86_64/root'env={'TERM': 'vt100', 'SHELL': '/bin/bash', 'HOME': '/builddir', 'HOSTNAME': 'mock', 'PATH': '/usr/bin:/bin:/usr/sbin:/sbin', 'PROMPT_COMMAND': 'printf "\\033]0;<mock-chroot>\\007"', 'PS1': '<mock-chroot> \\s-\\v\\$ ', 'LANG': 'de_DE.utf8', 'CCACHE_DIR': '/tmp/ccache', 'CCACHE_UMASK': '002'}shell=Falselogger=<mockbuild.trace_decorator.getLog object at 0x7f5d3407eef0>timeout=0uid=1000gid=997user='mockbuild'nspawn_args=['--private-network']printOutput=True)
Executing command: ['/usr/bin/systemd-nspawn', '-q', '-M', '855f01ad4bab4091871c1d49b487fd69', '-D', '/var/lib/mock/fedora-27-x86_64/root', '-a', '--private-network', '--setenv=TERM=vt100', '--setenv=SHELL=/bin/bash', '--setenv=HOME=/builddir', '--setenv=HOSTNAME=mock', '--setenv=PATH=/usr/bin:/bin:/usr/sbin:/sbin', '--setenv=PROMPT_COMMAND=printf "\\033]0;<mock-chroot>\\007"', '--setenv=PS1=<mock-chroot> \\s-\\v\\$ ', '--setenv=LANG=de_DE.utf8', '--setenv=CCACHE_DIR=/tmp/ccache', '--setenv=CCACHE_UMASK=002', '-u', 'mockbuild', 'bash', '--login', '-c', '/usr/bin/rpmbuild -bs --target x86_64 --nodeps /builddir/build/SPECS/bareos.spec'] with env {'TERM': 'vt100', 'SHELL': '/bin/bash', 'HOME': '/builddir', 'HOSTNAME': 'mock', 'PATH': '/usr/bin:/bin:/usr/sbin:/sbin', 'PROMPT_COMMAND': 'printf "\\033]0;<mock-chroot>\\007"', 'PS1': '<mock-chroot> \\s-\\v\\$ ', 'LANG': 'de_DE.utf8', 'CCACHE_DIR': '/tmp/ccache', 'CCACHE_UMASK': '002'} and shell False
Für folgende Zielplattform(en) wird gebaut: x86_64
Für das Ziel x86_64 wird gebaut
Erstellt: /builddir/build/SRPMS/bareos-17.2.3-1.fc27.src.rpm
Child return code was: 0
ENTER ['do'](['bash', '--login', '-c', '/usr/bin/rpmbuild -bb --target x86_64 --nodeps /builddir/build/SPECS/bareos.spec'], chrootPath='/var/lib/mock/fedora-27-x86_64/root'env={'TERM': 'vt100', 'SHELL': '/bin/bash', 'HOME': '/builddir', 'HOSTNAME': 'mock', 'PATH': '/usr/bin:/bin:/usr/sbin:/sbin', 'PROMPT_COMMAND': 'printf "\\033]0;<mock-chroot>\\007"', 'PS1': '<mock-chroot> \\s-\\v\\$ ', 'LANG': 'de_DE.utf8', 'CCACHE_DIR': '/tmp/ccache', 'CCACHE_UMASK': '002'}shell=Falselogger=<mockbuild.trace_decorator.getLog object at 0x7f5d3407eef0>timeout=0uid=1000gid=997user='mockbuild'nspawn_args=['--private-network']printOutput=True)
Executing command: ['/usr/bin/systemd-nspawn', '-q', '-M', 'a926b695dacc4292ad036756d6871e61', '-D', '/var/lib/mock/fedora-27-x86_64/root', '-a', '--private-network', '--setenv=TERM=vt100', '--setenv=SHELL=/bin/bash', '--setenv=HOME=/builddir', '--setenv=HOSTNAME=mock', '--setenv=PATH=/usr/bin:/bin:/usr/sbin:/sbin', '--setenv=PROMPT_COMMAND=printf "\\033]0;<mock-chroot>\\007"', '--setenv=PS1=<mock-chroot> \\s-\\v\\$ ', '--setenv=LANG=de_DE.utf8', '--setenv=CCACHE_DIR=/tmp/ccache', '--setenv=CCACHE_UMASK=002', '-u', 'mockbuild', 'bash', '--login', '-c', '/usr/bin/rpmbuild -bb --target x86_64 --nodeps /builddir/build/SPECS/bareos.spec'] with env {'TERM': 'vt100', 'SHELL': '/bin/bash', 'HOME': '/builddir', 'HOSTNAME': 'mock', 'PATH': '/usr/bin:/bin:/usr/sbin:/sbin', 'PROMPT_COMMAND': 'printf "\\033]0;<mock-chroot>\\007"', 'PS1': '<mock-chroot> \\s-\\v\\$ ', 'LANG': 'de_DE.utf8', 'CCACHE_DIR': '/tmp/ccache', 'CCACHE_UMASK': '002'} and shell False
Für folgende Zielplattform(en) wird gebaut: x86_64
Für das Ziel x86_64 wird gebaut
Ausführung(%prep): /bin/sh -e /var/tmp/rpm-tmp.3H9hAM
+ umask 022
+ cd /builddir/build/BUILD
+ cd /builddir/build/BUILD
+ rm -rf bareos-17.2.3
+ /usr/bin/gzip -dc /builddir/build/SOURCES/bareos-17.2.3.tar.gz
+ /usr/bin/tar -xof -
+ STATUS=0
+ '[' 0 -ne 0 ']'
+ cd bareos-17.2.3
+ /usr/bin/chmod -Rf a+rX,u+w,g-w,o-w .
+ exit 0
Ausführung(%build): /bin/sh -e /var/tmp/rpm-tmp.g4Fum2
+ umask 022
+ cd /builddir/build/BUILD
+ cd bareos-17.2.3
+ '[' /builddir/build/BUILDROOT/bareos-17.2.3-1.fc27.x86_64 -a /builddir/build/BUILDROOT/bareos-17.2.3-1.fc27.x86_64 '!=' / ']'
+ rm -rf /builddir/build/BUILDROOT/bareos-17.2.3-1.fc27.x86_64
+ export PATH=/usr/lib64/qt-3.3/bin:/usr/lib64/ccache:/usr/bin:/bin:/usr/sbin:/sbin:/usr/local/sbin:/builddir/.local/bin:/builddir/bin:/usr/lib64/qt4/bin:/usr/lib/qt4/bin
+ PATH=/usr/lib64/qt-3.3/bin:/usr/lib64/ccache:/usr/bin:/bin:/usr/sbin:/sbin:/usr/local/sbin:/builddir/.local/bin:/builddir/bin:/usr/lib64/qt4/bin:/usr/lib/qt4/bin
+ CFLAGS='-O2 -g -pipe -Wall -Werror=format-security -Wp,-D_FORTIFY_SOURCE=2 -fexceptions -fstack-protector-strong --param=ssp-buffer-size=4 -grecord-gcc-switches -specs=/usr/lib/rpm/redhat/redhat-hardened-cc1 -m64 -mtune=generic'
+ export CFLAGS
+ CXXFLAGS='-O2 -g -pipe -Wall -Werror=format-security -Wp,-D_FORTIFY_SOURCE=2 -fexceptions -fstack-protector-strong --param=ssp-buffer-size=4 -grecord-gcc-switches -specs=/usr/lib/rpm/redhat/redhat-hardened-cc1 -m64 -mtune=generic'
+ export CXXFLAGS
+ FFLAGS='-O2 -g -pipe -Wall -Werror=format-security -Wp,-D_FORTIFY_SOURCE=2 -fexceptions -fstack-protector-strong --param=ssp-buffer-size=4 -grecord-gcc-switches -specs=/usr/lib/rpm/redhat/redhat-hardened-cc1 -m64 -mtune=generic -I/usr/lib64/gfortran/modules'
+ export FFLAGS
+ FCFLAGS='-O2 -g -pipe -Wall -Werror=format-security -Wp,-D_FORTIFY_SOURCE=2 -fexceptions -fstack-protector-strong --param=ssp-buffer-size=4 -grecord-gcc-switches -specs=/usr/lib/rpm/redhat/redhat-hardened-cc1 -m64 -mtune=generic -I/usr/lib64/gfortran/modules'
+ export FCFLAGS
+ LDFLAGS='-Wl,-z,relro -specs=/usr/lib/rpm/redhat/redhat-hardened-ld'
+ export LDFLAGS
+ '[' 1 = 1 ']'
+++ dirname ./configure
++ find . -name config.guess -o -name config.sub
+ for i in $(find $(dirname ./configure) -name config.guess -o -name config.sub)
++ basename ./autoconf/config.sub
+ '[' -f /usr/lib/rpm/redhat/config.sub ']'
+ /usr/bin/rm -f ./autoconf/config.sub
++ basename ./autoconf/config.sub
+ /usr/bin/cp -fv /usr/lib/rpm/redhat/config.sub ./autoconf/config.sub
'/usr/lib/rpm/redhat/config.sub' -> './autoconf/config.sub'
+ for i in $(find $(dirname ./configure) -name config.guess -o -name config.sub)
++ basename ./autoconf/config.guess
+ '[' -f /usr/lib/rpm/redhat/config.guess ']'
+ /usr/bin/rm -f ./autoconf/config.guess
++ basename ./autoconf/config.guess
+ /usr/bin/cp -fv /usr/lib/rpm/redhat/config.guess ./autoconf/config.guess
'/usr/lib/rpm/redhat/config.guess' -> './autoconf/config.guess'
+ '[' 1 = 1 ']'
+ '[' x '!=' x-specs=/usr/lib/rpm/redhat/redhat-hardened-ld ']'
++ find . -name ltmain.sh
+ for i in $(find . -name ltmain.sh)
+ /usr/bin/sed -i.backup -e 's~compiler_flags=$~compiler_flags="-specs=/usr/lib/rpm/redhat/redhat-hardened-ld"~' ./autoconf/ltmain.sh
+ ./configure --build=x86_64-redhat-linux-gnu --host=x86_64-redhat-linux-gnu --program-prefix= --disable-dependency-tracking --prefix=/usr --exec-prefix=/usr --bindir=/usr/bin --sbindir=/usr/sbin --sysconfdir=/etc --datadir=/usr/share --includedir=/usr/include --libdir=/usr/lib64 --libexecdir=/usr/libexec --localstatedir=/var --sharedstatedir=/var/lib --mandir=/usr/share/man --infodir=/usr/share/info --prefix=/usr --libdir=/usr/lib64/bareos --sbindir=/usr/sbin --with-sbin-perm=755 --sysconfdir=/etc --with-confdir=/etc/bareos --mandir=/usr/share/man --docdir=/usr/share/doc/bareos --htmldir=/usr/share/doc/bareos/html --with-archivedir=/var/lib/bareos/storage --with-backenddir=/usr/lib64/bareos/backends --with-scriptdir=/usr/lib/bareos/scripts --with-working-dir=/var/lib/bareos --with-plugindir=/usr/lib64/bareos/plugins --with-pid-dir=/var/lib/bareos --with-bsrdir=/var/lib/bareos --with-logdir=/var/log/bareos --with-subsys-dir=/var/lock --with-python --enable-smartalloc --disable-conio --enable-readline --enable-batch-insert --enable-dynamic-cats-backends --enable-dynamic-storage-backends --enable-scsi-crypto --enable-lmdb --enable-ndmp --enable-ipv6 --enable-acl --enable-xattr --enable-traymonitor --with-postgresql --with-mysql --with-sqlite3 --with-tcp-wrappers --with-dir-user=bareos --with-dir-group=bareos --with-sd-user=bareos --with-sd-group=bareos --with-fd-user=root --with-fd-group=bareos --with-dir-password=XXX_REPLACE_WITH_DIRECTOR_PASSWORD_XXX --with-fd-password=XXX_REPLACE_WITH_CLIENT_PASSWORD_XXX --with-sd-password=XXX_REPLACE_WITH_STORAGE_PASSWORD_XXX --with-mon-dir-password=XXX_REPLACE_WITH_DIRECTOR_MONITOR_PASSWORD_XXX --with-mon-fd-password=XXX_REPLACE_WITH_CLIENT_MONITOR_PASSWORD_XXX --with-mon-sd-password=XXX_REPLACE_WITH_STORAGE_MONITOR_PASSWORD_XXX --with-openssl --with-basename=XXX_REPLACE_WITH_LOCAL_HOSTNAME_XXX --with-hostname=XXX_REPLACE_WITH_LOCAL_HOSTNAME_XXX --with-systemd --enable-includes
configure: WARNING: unrecognized options: --disable-dependency-tracking
checking for true... /usr/bin/true
checking for false... /usr/bin/false
configuring for Bareos 17.2.3 (14 Aug 2017)
checking for x86_64-redhat-linux-gnu-gcc... no
checking for gcc... gcc
checking whether the C compiler works... yes
checking for C compiler default output file name... a.out
checking for suffix of executables... 
checking whether we are cross compiling... no
checking for suffix of object files... o
checking whether we are using the GNU C compiler... yes
checking whether gcc accepts -g... yes
checking for gcc option to accept ISO C89... none needed
checking for x86_64-redhat-linux-gnu-g++... no
checking for x86_64-redhat-linux-gnu-c++... no
checking for x86_64-redhat-linux-gnu-gpp... no
checking for x86_64-redhat-linux-gnu-aCC... no
checking for x86_64-redhat-linux-gnu-CC... no
checking for x86_64-redhat-linux-gnu-cxx... no
checking for x86_64-redhat-linux-gnu-cc++... no
checking for x86_64-redhat-linux-gnu-cl.exe... no
checking for x86_64-redhat-linux-gnu-FCC... no
checking for x86_64-redhat-linux-gnu-KCC... no
checking for x86_64-redhat-linux-gnu-RCC... no
checking for x86_64-redhat-linux-gnu-xlC_r... no
checking for x86_64-redhat-linux-gnu-xlC... no
checking for g++... g++
checking whether we are using the GNU C++ compiler... yes
checking whether g++ accepts -g... yes
checking whether gcc and cc understand -c and -o together... yes
checking how to run the C preprocessor... gcc -E
checking for grep that handles long lines and -e... /usr/bin/grep
checking for egrep... /usr/bin/grep -E
checking whether gcc needs -traditional... no
checking for g++... /usr/lib64/ccache/g++
checking for a BSD-compatible install... /usr/bin/install -c
checking for mv... /usr/bin/mv
checking for rm... /usr/bin/rm
checking for echo... /usr/bin/echo
checking for cp... /usr/bin/cp
checking for sed... /usr/bin/sed
checking for cmp... /usr/bin/cmp
checking for tbl... /usr/bin/tbl
checking for ar... /usr/bin/ar
checking for openssl... /usr/bin/openssl
checking for mtx... /usr/sbin/mtx
checking for dd... /usr/bin/dd
checking for python... /usr/bin/python
checking for pkg-config... /usr/bin/pkg-config
checking for qmake... /usr/lib64/qt4/bin/qmake
checking for gmake... /usr/bin/gmake
checking for pidof... /usr/bin/pidof
checking for pgrep... /usr/bin/pgrep
checking for gcore... no
checking for gdb... no
checking for dbx... no
checking for mdb... no
checking for gawk... gawk
checking for gawk... /usr/bin/gawk
checking build system type... x86_64-redhat-linux-gnu
checking host system type... x86_64-redhat-linux-gnu
checking how to print strings... printf
checking for a sed that does not truncate output... (cached) /usr/bin/sed
checking for fgrep... /usr/bin/grep -F
checking for ld used by gcc... /usr/bin/ld
checking if the linker (/usr/bin/ld) is GNU ld... yes
checking for BSD- or MS-compatible name lister (nm)... /usr/bin/nm -B
checking the name lister (/usr/bin/nm -B) interface... BSD nm
checking whether ln -s works... yes
checking the maximum length of command line arguments... 1572864
checking how to convert x86_64-redhat-linux-gnu file names to x86_64-redhat-linux-gnu format... func_convert_file_noop
checking how to convert x86_64-redhat-linux-gnu file names to toolchain format... func_convert_file_noop
checking for /usr/bin/ld option to reload object files... -r
checking for x86_64-redhat-linux-gnu-objdump... no
checking for objdump... objdump
checking how to recognize dependent libraries... pass_all
checking for x86_64-redhat-linux-gnu-dlltool... no
checking for dlltool... no
checking how to associate runtime and link libraries... printf %s\n
checking for x86_64-redhat-linux-gnu-ar... /usr/bin/ar
checking for archiver @FILE support... @
checking for x86_64-redhat-linux-gnu-strip... no
checking for strip... strip
checking for x86_64-redhat-linux-gnu-ranlib... no
checking for ranlib... ranlib
checking command to parse /usr/bin/nm -B output from gcc object... ok
checking for sysroot... no
checking for a working dd... /usr/bin/dd
checking how to truncate binary pipes... /usr/bin/dd bs=4096 count=1
checking for x86_64-redhat-linux-gnu-mt... no
checking for mt... no
checking if : is a manifest tool... no
checking for ANSI C header files... yes
checking for sys/types.h... yes
checking for sys/stat.h... yes
checking for stdlib.h... yes
checking for string.h... yes
checking for memory.h... yes
checking for strings.h... yes
checking for inttypes.h... yes
checking for stdint.h... yes
checking for unistd.h... yes
checking for dlfcn.h... yes
checking for objdir... .libs
checking if gcc supports -fno-rtti -fno-exceptions... no
checking for gcc option to produce PIC... -fPIC -DPIC
checking if gcc PIC flag -fPIC -DPIC works... yes
checking if gcc static flag -static works... no
checking if gcc supports -c -o file.o... yes
checking if gcc supports -c -o file.o... (cached) yes
checking whether the gcc linker (/usr/bin/ld -m elf_x86_64) supports shared libraries... yes
checking whether -lc should be explicitly linked in... no
checking dynamic linker characteristics... GNU/Linux ld.so
checking how to hardcode library paths into programs... immediate
checking whether stripping libraries is possible... yes
checking if libtool supports shared libraries... yes
checking whether to build shared libraries... yes
checking whether to build static libraries... no
checking how to run the C++ preprocessor... /usr/lib64/ccache/g++ -E
checking for ld used by /usr/lib64/ccache/g++... /usr/bin/ld -m elf_x86_64
checking if the linker (/usr/bin/ld -m elf_x86_64) is GNU ld... yes
checking whether the /usr/lib64/ccache/g++ linker (/usr/bin/ld -m elf_x86_64) supports shared libraries... yes
checking for /usr/lib64/ccache/g++ option to produce PIC... -fPIC -DPIC
checking if /usr/lib64/ccache/g++ PIC flag -fPIC -DPIC works... yes
checking if /usr/lib64/ccache/g++ static flag -static works... no
checking if /usr/lib64/ccache/g++ supports -c -o file.o... yes
checking if /usr/lib64/ccache/g++ supports -c -o file.o... (cached) yes
checking whether the /usr/lib64/ccache/g++ linker (/usr/bin/ld -m elf_x86_64) supports shared libraries... yes
checking dynamic linker characteristics... (cached) GNU/Linux ld.so
checking how to hardcode library paths into programs... immediate
checking for library containing dlopen... -ldl
checking for dlerror... yes
checking for shl_load... no
checking for shl_load in -ldld... no
checking for dld_link in -ldld... no
checking for Operating System Distribution... done
checking for OBS OS Distribution... done
checking whether make sets $(MAKE)... yes
checking whether NLS is requested... yes
checking for msgfmt... /usr/bin/msgfmt
checking for gmsgfmt... /usr/bin/msgfmt
checking for xgettext... /usr/bin/xgettext
checking for msgmerge... /usr/bin/msgmerge
checking for ld used by GCC... /usr/bin/ld -m elf_x86_64
checking if the linker (/usr/bin/ld -m elf_x86_64) is GNU ld... yes
checking for shared library run path origin... done
checking for CFPreferencesCopyAppValue... no
checking for CFLocaleCopyCurrent... no
checking whether NLS is requested... yes
checking for GNU gettext in libc... yes
checking whether to use NLS... yes
checking where the gettext function comes from... libc
checking for msgfmt... (cached) /usr/bin/msgfmt
checking curses.h usability... yes
checking curses.h presence... yes
checking for curses.h... yes
checking for tgetent in -ltinfo... yes
checking /usr/include/readline/readline.h usability... yes
checking /usr/include/readline/readline.h presence... yes
checking for /usr/include/readline/readline.h... yes
checking whether stat file-mode macros are broken... no
checking for dirent.h that defines DIR... yes
checking for library containing opendir... none required
checking glob.h usability... yes
checking glob.h presence... yes
checking for glob.h... yes
checking poll.h usability... yes
checking poll.h presence... yes
checking for poll.h... yes
checking sys/poll.h usability... yes
checking sys/poll.h presence... yes
checking for sys/poll.h... yes
checking for glob... yes
checking for strcasecmp... yes
checking for select... yes
checking for poll... yes
checking for setenv... yes
checking for putenv... yes
checking for tcgetattr... yes
checking for lstat... yes
checking for lchown... yes
checking for lchmod... no
checking for utimes... yes
checking for lutimes... yes
checking for futimes... yes
checking for futimens... yes
checking for fchmod... yes
checking for fchown... yes
checking for nanosleep... yes
checking for nl_langinfo... yes
checking varargs.h usability... no
checking varargs.h presence... no
checking for varargs.h... no
checking for cmocka support... checking for setjmp.h... yes
checking for cmocka.h... yes
checking for _will_return in -lcmocka... yes
yes
checking for Python support... yes
configure: checking for more Python libs
checking for library containing shm_open... -lrt
checking for openpty in -lutil... yes
checking for socket... yes
using socket from libc
checking for library containing nanosleep... none required
checking for libwrap... yes
checking for OpenSSL... no
checking for library containing dlopen... (cached) -ldl
checking for logrotate... /usr/sbin/logrotate
checking for PostgreSQL support... yes
checking for crypt... no
checking for crypt in -lcrypt... yes
checking for PQisthreadsafe in -lpq... yes
checking for PQputCopyData in -lpq... yes
checking for MySQL support... yes
checking for mysql_thread_safe in -lmysqlclient_r... yes
checking for MySQL embedded support... no
checking for SQLite3 support... yes
checking for sqlite3_threadsafe in -lsqlite3... yes
checking for x86_64-redhat-linux-gnu-getconf... no
checking for getconf... getconf
checking for CFLAGS value to request large file support... 
checking for LDFLAGS value to request large file support... 
checking for LIBS value to request large file support... 
checking for _FILE_OFFSET_BITS... 64
checking for _LARGEFILE_SOURCE... 1
checking for _LARGE_FILES... 1
checking for X... libraries , headers 
checking for gethostbyname... yes
checking for connect... yes
checking for remove... yes
checking for shmat... yes
checking for IceConnectionNumber in -lICE... yes
checking assert.h usability... yes
checking assert.h presence... yes
checking for assert.h... yes
checking dl.h usability... no
checking dl.h presence... no
checking for dl.h... no
checking for dlfcn.h... (cached) yes
checking fcntl.h usability... yes
checking fcntl.h presence... yes
checking for fcntl.h... yes
checking grp.h usability... yes
checking grp.h presence... yes
checking for grp.h... yes
checking pwd.h usability... yes
checking pwd.h presence... yes
checking for pwd.h... yes
checking libc.h usability... no
checking libc.h presence... no
checking for libc.h... no
checking limits.h usability... yes
checking limits.h presence... yes
checking for limits.h... yes
checking stdarg.h usability... yes
checking stdarg.h presence... yes
checking for stdarg.h... yes
checking for stdlib.h... (cached) yes
checking for stdint.h... (cached) yes
checking for inttypes.h... (cached) yes
checking for string.h... (cached) yes
checking for strings.h... (cached) yes
checking termios.h usability... yes
checking termios.h presence... yes
checking for termios.h... yes
checking termcap.h usability... yes
checking termcap.h presence... yes
checking for termcap.h... yes
checking term.h usability... yes
checking term.h presence... yes
checking for term.h... yes
checking for unistd.h... (cached) yes
checking sys/bitypes.h usability... yes
checking sys/bitypes.h presence... yes
checking for sys/bitypes.h... yes
checking sys/byteorder.h usability... no
checking sys/byteorder.h presence... no
checking for sys/byteorder.h... no
checking sys/ioctl.h usability... yes
checking sys/ioctl.h presence... yes
checking for sys/ioctl.h... yes
checking sys/select.h usability... yes
checking sys/select.h presence... yes
checking for sys/select.h... yes
checking sys/socket.h usability... yes
checking sys/socket.h presence... yes
checking for sys/socket.h... yes
checking sys/sockio.h usability... no
checking sys/sockio.h presence... no
checking for sys/sockio.h... no
checking for sys/stat.h... (cached) yes
checking sys/time.h usability... yes
checking sys/time.h presence... yes
checking for sys/time.h... yes
checking for sys/types.h... (cached) yes
checking arpa/nameser.h usability... yes
checking arpa/nameser.h presence... yes
checking for arpa/nameser.h... yes
checking mtio.h usability... no
checking mtio.h presence... no
checking for mtio.h... no
checking sys/dl.h usability... no
checking sys/dl.h presence... no
checking for sys/dl.h... no
checking sys/mtio.h usability... yes
checking sys/mtio.h presence... yes
checking for sys/mtio.h... yes
checking sys/tape.h usability... no
checking sys/tape.h presence... no
checking for sys/tape.h... no
checking regex.h usability... yes
checking regex.h presence... yes
checking for regex.h... yes
checking for ANSI C header files... (cached) yes
checking whether sys/types.h defines makedev... yes
checking for dirent.h that defines DIR... (cached) yes
checking for library containing opendir... (cached) none required
checking whether stat file-mode macros are broken... (cached) no
checking for sys/wait.h that is POSIX.1 compatible... yes
checking whether time.h and sys/time.h may both be included... yes
checking for struct stat.st_blksize... yes
checking for struct stat.st_blocks... yes
checking whether struct tm is in sys/time.h or time.h... time.h
checking for struct tm.tm_zone... yes
checking for utime.h... yes
checking for socklen_t... yes
checking for ioctl_req_t... yes
checking for typeof... yes
checking for an ANSI C-conforming const... yes
checking whether byte ordering is bigendian... no
checking how to get filesystem type... 4.3BSD
checking sys/statvfs.h usability... yes
checking sys/statvfs.h presence... yes
checking for sys/statvfs.h... yes
checking return type of signal handlers... void
checking for type of signal functions... posix
checking for mode_t... yes
checking for uid_t in sys/types.h... yes
checking for size_t... yes
checking for pid_t... yes
checking for off_t... yes
checking for intptr_t... yes
checking for uintptr_t... yes
checking for ino_t... yes
checking for dev_t... yes
checking for daddr_t... yes
checking for major_t... no
checking for minor_t... no
checking for ssize_t... yes
checking for struct stat.st_blocks... (cached) yes
checking for struct stat.st_rdev... yes
checking whether struct tm is in sys/time.h or time.h... (cached) time.h
checking for an ANSI C-conforming const... (cached) yes
checking size of char... 1
checking size of short int... 2
checking size of int... 4
checking size of long int... 8
checking size of long long int... 8
checking size of int *... 8
checking for u_int type... yes
checking for intmax_t type... yes
checking for u_intmax_t type... no
checking for intXX_t types... yes
checking for int64_t type... yes
checking for u_intXX_t types... yes
checking for u_int64_t types... yes
checking for uintXX_t types in sys/bitypes.h... no
checking for fork... yes
checking for getcwd... yes
checking for gethostname... yes
checking for getpid... yes
checking for gettimeofday... yes
checking for setpgid... yes
checking for setpgrp... yes
checking for setsid... yes
checking for signal... yes
checking for strerror... yes
checking for strncmp... yes
checking for strncpy... yes
checking for vfprintf... yes
checking whether F_CLOSEM is declared... no
checking for bcopy... yes
checking for closefrom... no
checking for getpagesize... yes
checking for malloc_trim... yes
checking for backtrace_symbols... yes
checking for backtrace... yes
checking execinfo.h usability... yes
checking execinfo.h presence... yes
checking for execinfo.h... yes
checking cxxabi.h usability... yes
checking cxxabi.h presence... yes
checking for cxxabi.h... yes
checking for fchdir... yes
checking for strtoll... yes
checking for posix_fadvise... yes
checking for fdatasync... yes
checking for chflags... no
checking for snprintf... yes
checking for vsnprintf... yes
checking for gethostid... yes
checking for fseeko... yes
checking for va_copy... yes
checking for localtime_r... yes
checking for readdir_r... yes
checking for strerror_r... yes
checking for gethostbyname_r... yes
using gethostbyname_r from resolver in libc
checking for inet_pton... yes
checking for inet_ntop... yes
checking for gethostbyname2... yes
checking for struct sockaddr has a sa_len field... no
checking for working getaddrinfo... yes
checking for gai_strerror... yes
checking for strftime... yes
checking for vprintf... yes
checking for _doprnt... no
checking for working alloca.h... yes
checking for alloca... yes
checking for library containing getmntent... none required
checking for getmntinfo... no
checking whether closedir returns void... no
checking whether setpgrp takes no argument... yes
checking for gettext in -lintl... no
checking for getpwnam in -lsun... no
checking zlib.h usability... yes
checking zlib.h presence... yes
checking for zlib.h... yes
checking for compressBound in zlib library... yes
checking for deflate in zlib library... yes
checking lzo/lzoconf.h usability... yes
checking lzo/lzoconf.h presence... yes
checking for lzo/lzoconf.h... yes
checking lzo/lzo1x.h usability... yes
checking lzo/lzo1x.h presence... yes
checking for lzo/lzo1x.h... yes
checking for lzo1x_1_compress in lzo library... yes
checking fastlzlib.h usability... yes
checking fastlzlib.h presence... yes
checking for fastlzlib.h... yes
checking for fastlzlibCompress in fastlz library... yes
checking afs/afsint.h usability... no
checking afs/afsint.h presence... no
checking for afs/afsint.h... no
checking for pioctl in AFS libsys... no
checking sys/acl.h usability... yes
checking sys/acl.h presence... yes
checking for sys/acl.h... yes
checking for acl_get_file... no
checking for acl_get_file in -lacl... yes
checking sys/xattr.h usability... yes
checking sys/xattr.h presence... yes
checking for sys/xattr.h... yes
checking for llistxattr... yes
checking for lgetxattr... yes
checking for lsetxattr... yes
checking scsi/sg.h usability... yes
checking scsi/sg.h presence... yes
checking for scsi/sg.h... yes
checking scsi/scsi.h usability... yes
checking scsi/scsi.h presence... yes
checking for scsi/scsi.h... yes
checking api/glfs.h usability... yes
checking api/glfs.h presence... yes
checking for api/glfs.h... yes
checking for glfs_init in gfapi library... yes
checking for glfs_readdirplus... yes
checking droplet.h usability... no
checking droplet.h presence... no
checking for droplet.h... no
checking for dpl_ctx_new in libdroplet library... no
checking rados/librados.h usability... yes
checking rados/librados.h presence... yes
checking for rados/librados.h... yes
checking for rados_create in rados library... yes
checking for rados_ioctx_set_namespace in -lrados... yes
checking for rados_nobjects_list_open in -lrados... yes
checking radosstriper/libradosstriper.h usability... yes
checking radosstriper/libradosstriper.h presence... yes
checking for radosstriper/libradosstriper.h... yes
checking for rados_striper_create in radosstriper library... yes
checking cephfs/libcephfs.h usability... yes
checking cephfs/libcephfs.h presence... yes
checking for cephfs/libcephfs.h... yes
checking for ceph_create in cephfs library... yes
checking elasto/data.h usability... no
checking elasto/data.h presence... no
checking for elasto/data.h... no
checking elasto/file.h usability... no
checking elasto/file.h presence... no
checking for elasto/file.h... no
checking for elasto_fclose in -lelasto_file... no
checking for pthread_create in -lpthread... yes
checking sys/prctl.h usability... yes
checking sys/prctl.h presence... yes
checking for sys/prctl.h... yes
checking sys/capability.h usability... yes
checking sys/capability.h presence... yes
checking for sys/capability.h... yes
checking for prctl... yes
checking for setreuid... yes
checking for cap_set_proc in -lcap... yes
checking for systemd support... checking for systemctl... yes
yes
configure: creating ./config.status
config.status: creating autoconf/Make.common
config.status: creating Makefile
config.status: creating GNUmakefile
config.status: creating manpages/Makefile
config.status: creating scripts/bareos-config
config.status: creating scripts/bareos-config-lib.sh
config.status: creating scripts/bareos-explorer
config.status: creating scripts/bareos-glusterfind-wrapper
config.status: creating scripts/btraceback
config.status: creating scripts/bconsole
config.status: creating scripts/bareos
config.status: creating scripts/bareos-ctl-dir
config.status: creating scripts/bareos-ctl-fd
config.status: creating scripts/bareos-ctl-sd
config.status: creating scripts/devel_bareos
config.status: creating scripts/Makefile
config.status: creating scripts/bareos-regress.conf
config.status: creating scripts/logrotate
config.status: creating scripts/mtx-changer
config.status: creating scripts/disk-changer
config.status: creating scripts/logwatch/Makefile
config.status: creating scripts/logwatch/logfile.bareos.conf
config.status: creating src/Makefile
config.status: creating src/include/host.h
config.status: creating src/console/Makefile
config.status: creating src/console/bconsole.conf
config.status: creating src/qt-tray-monitor/bareos-tray-monitor.desktop
config.status: creating src/qt-tray-monitor/tray-monitor.conf
config.status: creating src/qt-tray-monitor/tray-monitor.pro
config.status: creating src/defaultconfigs/bareos-dir.d/catalog/MyCatalog.conf
config.status: creating src/defaultconfigs/bareos-dir.d/client/bareos-fd.conf
config.status: creating src/defaultconfigs/bareos-dir.d/console/bareos-mon.conf
config.status: creating src/defaultconfigs/bareos-dir.d/director/bareos-dir.conf
config.status: creating src/defaultconfigs/bareos-dir.d/fileset/Catalog.conf
config.status: creating src/defaultconfigs/bareos-dir.d/fileset/LinuxAll.conf
config.status: creating src/defaultconfigs/bareos-dir.d/fileset/SelfTest.conf
config.status: creating src/defaultconfigs/bareos-dir.d/job/BackupCatalog.conf
config.status: creating src/defaultconfigs/bareos-dir.d/jobdefs/DefaultJob.conf
config.status: creating src/defaultconfigs/bareos-dir.d/messages/Daemon.conf
config.status: creating src/defaultconfigs/bareos-dir.d/messages/Standard.conf
config.status: creating src/defaultconfigs/bareos-dir.d/storage/File.conf
config.status: creating src/defaultconfigs/bareos-sd.d/device/FileStorage.conf
config.status: creating src/defaultconfigs/bareos-sd.d/director/bareos-dir.conf
config.status: creating src/defaultconfigs/bareos-sd.d/director/bareos-mon.conf
config.status: creating src/defaultconfigs/bareos-sd.d/storage/bareos-sd.conf
config.status: creating src/defaultconfigs/bareos-fd.d/client/myself.conf
config.status: creating src/defaultconfigs/bareos-fd.d/director/bareos-dir.conf
config.status: creating src/defaultconfigs/bareos-fd.d/director/bareos-mon.conf
config.status: creating src/defaultconfigs/tray-monitor.d/client/FileDaemon-local.conf
config.status: creating src/defaultconfigs/tray-monitor.d/director/Director-local.conf
config.status: creating src/defaultconfigs/tray-monitor.d/monitor/bareos-mon.conf
config.status: creating src/defaultconfigs/tray-monitor.d/storage/StorageDaemon-local.conf
config.status: creating src/dird/Makefile
config.status: creating src/dird/bareos-dir.conf
config.status: creating src/lib/Makefile
config.status: creating src/lib/unittests/Makefile
config.status: creating src/stored/Makefile
config.status: creating src/stored/bareos-sd.conf
config.status: creating src/stored/backends/Makefile
config.status: creating src/filed/Makefile
config.status: creating src/filed/bareos-fd.conf
config.status: creating src/cats/Makefile
config.status: creating src/cats/make_catalog_backup.pl
config.status: creating src/cats/make_catalog_backup
config.status: creating src/cats/delete_catalog_backup
config.status: creating src/cats/create_bareos_database
config.status: creating src/cats/update_bareos_tables
config.status: creating src/cats/grant_bareos_privileges
config.status: creating src/cats/make_bareos_tables
config.status: creating src/cats/drop_bareos_tables
config.status: creating src/cats/drop_bareos_database
config.status: creating src/cats/install-default-backend
config.status: creating src/cats/ddl/versions.map
config.status: creating src/findlib/Makefile
config.status: creating src/findlib/unittests/Makefile
config.status: creating src/lmdb/Makefile
config.status: creating src/ndmp/Makefile
config.status: creating src/tests/Makefile
config.status: creating src/tools/Makefile
config.status: creating src/plugins/filed/Makefile
config.status: creating src/plugins/filed/python-ldap-conf.d/bareos-dir.d/fileset/plugin-ldap.conf.example
config.status: creating src/plugins/stored/Makefile
config.status: creating src/plugins/dird/Makefile
config.status: creating po/Makefile.in
config.status: creating src/defaultconfigs/diskonly/bareos-sd.conf
config.status: creating src/defaultconfigs/diskonly/bareos-dir.conf
config.status: creating platforms/Makefile
config.status: creating platforms/redhat/Makefile
config.status: creating platforms/redhat/bareos-fd
config.status: creating platforms/redhat/bareos-sd
config.status: creating platforms/redhat/bareos-dir
config.status: creating platforms/systemd/Makefile
config.status: creating platforms/systemd/bareos.conf
config.status: creating platforms/systemd/bareos-dir.service
config.status: creating platforms/systemd/bareos-fd.service
config.status: creating platforms/systemd/bareos-sd.service
config.status: creating debian/bareos-filedaemon.service
config.status: creating debian/bareos-storage.service
config.status: creating debian/bareos-director.service
config.status: creating src/include/config.h
config.status: executing libtool commands
config.status: executing default-1 commands
config.status: creating po/POTFILES
config.status: creating po/Makefile
configure: WARNING: unrecognized options: --disable-dependency-tracking
Creating tray-monitor Makefile
rm -f moc/moc_traymenu.cpp moc/moc_systemtrayicon.cpp moc/moc_mainwindow.cpp moc/moc_monitoritem.cpp moc/moc_monitoritemthread.cpp
rm -f qrc_main.cpp
rm -f ui/ui_mainwindow.h
rm -f obj/authenticate.o obj/tray_conf.o obj/tray-monitor.o obj/traymenu.o obj/systemtrayicon.o obj/mainwindow.o obj/monitoritem.o obj/monitoritemthread.o obj/moc_traymenu.o obj/moc_systemtrayicon.o obj/moc_mainwindow.o obj/moc_monitoritem.o obj/moc_monitoritemthread.o obj/qrc_main.o
rm -f .libs/* bareos-tray-monitor release/bareos-tray-monitor
rm -f *~ core *.core
Doing make of dependencies
==>Entering directory /builddir/build/BUILD/bareos-17.2.3/src
make[1]: Entering directory '/builddir/build/BUILD/bareos-17.2.3/src'
make[1]: Nothing to be done for 'depend'.
make[1]: Leaving directory '/builddir/build/BUILD/bareos-17.2.3/src'
==>Entering directory /builddir/build/BUILD/bareos-17.2.3/scripts
make[1]: Entering directory '/builddir/build/BUILD/bareos-17.2.3/scripts'
make[1]: Nothing to be done for 'depend'.
make[1]: Leaving directory '/builddir/build/BUILD/bareos-17.2.3/scripts'
==>Entering directory /builddir/build/BUILD/bareos-17.2.3/src/lib
make[1]: Entering directory '/builddir/build/BUILD/bareos-17.2.3/src/lib'
make[1]: Leaving directory '/builddir/build/BUILD/bareos-17.2.3/src/lib'
==>Entering directory /builddir/build/BUILD/bareos-17.2.3/src/findlib
make[1]: Entering directory '/builddir/build/BUILD/bareos-17.2.3/src/findlib'
make[1]: Leaving directory '/builddir/build/BUILD/bareos-17.2.3/src/findlib'
==>Entering directory /builddir/build/BUILD/bareos-17.2.3/src/lmdb
make[1]: Entering directory '/builddir/build/BUILD/bareos-17.2.3/src/lmdb'
make[1]: Leaving directory '/builddir/build/BUILD/bareos-17.2.3/src/lmdb'
==>Entering directory /builddir/build/BUILD/bareos-17.2.3/src/filed
make[1]: Entering directory '/builddir/build/BUILD/bareos-17.2.3/src/filed'
make[1]: Leaving directory '/builddir/build/BUILD/bareos-17.2.3/src/filed'
==>Entering directory /builddir/build/BUILD/bareos-17.2.3/src/qt-tray-monitor
make[1]: Entering directory '/builddir/build/BUILD/bareos-17.2.3/src/qt-tray-monitor'
make[1]: Nothing to be done for 'depend'.
make[1]: Leaving directory '/builddir/build/BUILD/bareos-17.2.3/src/qt-tray-monitor'
==>Entering directory /builddir/build/BUILD/bareos-17.2.3/src/console
make[1]: Entering directory '/builddir/build/BUILD/bareos-17.2.3/src/console'
make[1]: Leaving directory '/builddir/build/BUILD/bareos-17.2.3/src/console'
==>Entering directory /builddir/build/BUILD/bareos-17.2.3/src/plugins/filed
make[1]: Entering directory '/builddir/build/BUILD/bareos-17.2.3/src/plugins/filed'
make[1]: Nothing to be done for 'depend'.
make[1]: Leaving directory '/builddir/build/BUILD/bareos-17.2.3/src/plugins/filed'
==>Entering directory /builddir/build/BUILD/bareos-17.2.3/src/cats
make[1]: Entering directory '/builddir/build/BUILD/bareos-17.2.3/src/cats'
make[1]: Leaving directory '/builddir/build/BUILD/bareos-17.2.3/src/cats'
==>Entering directory /builddir/build/BUILD/bareos-17.2.3/src/ndmp
make[1]: Entering directory '/builddir/build/BUILD/bareos-17.2.3/src/ndmp'
rpcgen -C -M ndmp0.x
rpcgen -C -M ndmp2.x
rpcgen -C -M ndmp3.x
rpcgen -C -M ndmp4.x
rpcgen -C -M ndmp9.x
make[1]: Leaving directory '/builddir/build/BUILD/bareos-17.2.3/src/ndmp'
==>Entering directory /builddir/build/BUILD/bareos-17.2.3/src/dird
make[1]: Entering directory '/builddir/build/BUILD/bareos-17.2.3/src/dird'
make[1]: Leaving directory '/builddir/build/BUILD/bareos-17.2.3/src/dird'
==>Entering directory /builddir/build/BUILD/bareos-17.2.3/src/stored
make[1]: Entering directory '/builddir/build/BUILD/bareos-17.2.3/src/stored'
make[1]: Leaving directory '/builddir/build/BUILD/bareos-17.2.3/src/stored'
==>Entering directory /builddir/build/BUILD/bareos-17.2.3/src/stored/backends
make[1]: Entering directory '/builddir/build/BUILD/bareos-17.2.3/src/stored/backends'
make[1]: Nothing to be done for 'depend'.
make[1]: Leaving directory '/builddir/build/BUILD/bareos-17.2.3/src/stored/backends'
==>Entering directory /builddir/build/BUILD/bareos-17.2.3/src/plugins/stored
make[1]: Entering directory '/builddir/build/BUILD/bareos-17.2.3/src/plugins/stored'
make[1]: Nothing to be done for 'depend'.
make[1]: Leaving directory '/builddir/build/BUILD/bareos-17.2.3/src/plugins/stored'
==>Entering directory /builddir/build/BUILD/bareos-17.2.3/src/plugins/dird
make[1]: Entering directory '/builddir/build/BUILD/bareos-17.2.3/src/plugins/dird'
make[1]: Nothing to be done for 'depend'.
make[1]: Leaving directory '/builddir/build/BUILD/bareos-17.2.3/src/plugins/dird'
==>Entering directory /builddir/build/BUILD/bareos-17.2.3/src/tools
make[1]: Entering directory '/builddir/build/BUILD/bareos-17.2.3/src/tools'
make[1]: Leaving directory '/builddir/build/BUILD/bareos-17.2.3/src/tools'
==>Entering directory /builddir/build/BUILD/bareos-17.2.3/src/tests
make[1]: Entering directory '/builddir/build/BUILD/bareos-17.2.3/src/tests'
make[1]: Leaving directory '/builddir/build/BUILD/bareos-17.2.3/src/tests'
==>Entering directory /builddir/build/BUILD/bareos-17.2.3/manpages
make[1]: Entering directory '/builddir/build/BUILD/bareos-17.2.3/manpages'
make[1]: Nothing to be done for 'depend'.
make[1]: Leaving directory '/builddir/build/BUILD/bareos-17.2.3/manpages'
==>Entering directory /builddir/build/BUILD/bareos-17.2.3/platforms
make[1]: Entering directory '/builddir/build/BUILD/bareos-17.2.3/platforms'
make[1]: Nothing to be done for 'depend'.
make[1]: Leaving directory '/builddir/build/BUILD/bareos-17.2.3/platforms'
 
Cleaning up
 
==>Entering directory /builddir/build/BUILD/bareos-17.2.3/src
make[1]: Entering directory '/builddir/build/BUILD/bareos-17.2.3/src'
make[1]: Leaving directory '/builddir/build/BUILD/bareos-17.2.3/src'
==>Entering directory /builddir/build/BUILD/bareos-17.2.3/scripts
make[1]: Entering directory '/builddir/build/BUILD/bareos-17.2.3/scripts'
make[1]: Leaving directory '/builddir/build/BUILD/bareos-17.2.3/scripts'
==>Entering directory /builddir/build/BUILD/bareos-17.2.3/src/lib
make[1]: Entering directory '/builddir/build/BUILD/bareos-17.2.3/src/lib'
make[1]: Leaving directory '/builddir/build/BUILD/bareos-17.2.3/src/lib'
==>Entering directory /builddir/build/BUILD/bareos-17.2.3/src/findlib
make[1]: Entering directory '/builddir/build/BUILD/bareos-17.2.3/src/findlib'
make[1]: Leaving directory '/builddir/build/BUILD/bareos-17.2.3/src/findlib'
==>Entering directory /builddir/build/BUILD/bareos-17.2.3/src/lmdb
make[1]: Entering directory '/builddir/build/BUILD/bareos-17.2.3/src/lmdb'
make[1]: Leaving directory '/builddir/build/BUILD/bareos-17.2.3/src/lmdb'
==>Entering directory /builddir/build/BUILD/bareos-17.2.3/src/filed
make[1]: Entering directory '/builddir/build/BUILD/bareos-17.2.3/src/filed'
make[1]: Leaving directory '/builddir/build/BUILD/bareos-17.2.3/src/filed'
==>Entering directory /builddir/build/BUILD/bareos-17.2.3/src/qt-tray-monitor
make[1]: Entering directory '/builddir/build/BUILD/bareos-17.2.3/src/qt-tray-monitor'
rm -f moc/moc_traymenu.cpp moc/moc_systemtrayicon.cpp moc/moc_mainwindow.cpp moc/moc_monitoritem.cpp moc/moc_monitoritemthread.cpp
rm -f qrc_main.cpp
rm -f ui/ui_mainwindow.h
rm -f obj/authenticate.o obj/tray_conf.o obj/tray-monitor.o obj/traymenu.o obj/systemtrayicon.o obj/mainwindow.o obj/monitoritem.o obj/monitoritemthread.o obj/moc_traymenu.o obj/moc_systemtrayicon.o obj/moc_mainwindow.o obj/moc_monitoritem.o obj/moc_monitoritemthread.o obj/qrc_main.o
rm -f .libs/* bareos-tray-monitor release/bareos-tray-monitor
rm -f *~ core *.core
make[1]: Leaving directory '/builddir/build/BUILD/bareos-17.2.3/src/qt-tray-monitor'
==>Entering directory /builddir/build/BUILD/bareos-17.2.3/src/console
make[1]: Entering directory '/builddir/build/BUILD/bareos-17.2.3/src/console'
make[1]: Leaving directory '/builddir/build/BUILD/bareos-17.2.3/src/console'
==>Entering directory /builddir/build/BUILD/bareos-17.2.3/src/plugins/filed
make[1]: Entering directory '/builddir/build/BUILD/bareos-17.2.3/src/plugins/filed'
make[1]: Leaving directory '/builddir/build/BUILD/bareos-17.2.3/src/plugins/filed'
==>Entering directory /builddir/build/BUILD/bareos-17.2.3/src/cats
make[1]: Entering directory '/builddir/build/BUILD/bareos-17.2.3/src/cats'
make[1]: Leaving directory '/builddir/build/BUILD/bareos-17.2.3/src/cats'
==>Entering directory /builddir/build/BUILD/bareos-17.2.3/src/ndmp
make[1]: Entering directory '/builddir/build/BUILD/bareos-17.2.3/src/ndmp'
make[1]: Leaving directory '/builddir/build/BUILD/bareos-17.2.3/src/ndmp'
==>Entering directory /builddir/build/BUILD/bareos-17.2.3/src/dird
make[1]: Entering directory '/builddir/build/BUILD/bareos-17.2.3/src/dird'
make[1]: Leaving directory '/builddir/build/BUILD/bareos-17.2.3/src/dird'
==>Entering directory /builddir/build/BUILD/bareos-17.2.3/src/stored
make[1]: Entering directory '/builddir/build/BUILD/bareos-17.2.3/src/stored'
make[1]: Leaving directory '/builddir/build/BUILD/bareos-17.2.3/src/stored'
==>Entering directory /builddir/build/BUILD/bareos-17.2.3/src/stored/backends
make[1]: Entering directory '/builddir/build/BUILD/bareos-17.2.3/src/stored/backends'
make[1]: Leaving directory '/builddir/build/BUILD/bareos-17.2.3/src/stored/backends'
==>Entering directory /builddir/build/BUILD/bareos-17.2.3/src/plugins/stored
make[1]: Entering directory '/builddir/build/BUILD/bareos-17.2.3/src/plugins/stored'
find . -name '*.lo' -print | xargs /builddir/build/BUILD/bareos-17.2.3/libtool --silent --tag=CXX --mode=clean /usr/bin/rm -f
/usr/bin/rm -f *.la
/usr/bin/rm -f -r .libs _libs
make[1]: Leaving directory '/builddir/build/BUILD/bareos-17.2.3/src/plugins/stored'
==>Entering directory /builddir/build/BUILD/bareos-17.2.3/src/plugins/dird
make[1]: Entering directory '/builddir/build/BUILD/bareos-17.2.3/src/plugins/dird'
find . -name '*.lo' -print | xargs /builddir/build/BUILD/bareos-17.2.3/libtool --silent --tag=CXX --mode=clean /usr/bin/rm -f
/usr/bin/rm -f *.la
/usr/bin/rm -f -r .libs _libs
make[1]: Leaving directory '/builddir/build/BUILD/bareos-17.2.3/src/plugins/dird'
==>Entering directory /builddir/build/BUILD/bareos-17.2.3/src/tools
make[1]: Entering directory '/builddir/build/BUILD/bareos-17.2.3/src/tools'
make[1]: Leaving directory '/builddir/build/BUILD/bareos-17.2.3/src/tools'
==>Entering directory /builddir/build/BUILD/bareos-17.2.3/src/tests
make[1]: Entering directory '/builddir/build/BUILD/bareos-17.2.3/src/tests'
make[1]: Leaving directory '/builddir/build/BUILD/bareos-17.2.3/src/tests'
==>Entering directory /builddir/build/BUILD/bareos-17.2.3/manpages
make[1]: Entering directory '/builddir/build/BUILD/bareos-17.2.3/manpages'
make[1]: Leaving directory '/builddir/build/BUILD/bareos-17.2.3/manpages'
==>Entering directory /builddir/build/BUILD/bareos-17.2.3/platforms
make[1]: Entering directory '/builddir/build/BUILD/bareos-17.2.3/platforms'
make[2]: Entering directory '/builddir/build/BUILD/bareos-17.2.3/platforms/redhat'
make[2]: Leaving directory '/builddir/build/BUILD/bareos-17.2.3/platforms/redhat'
make[2]: Entering directory '/builddir/build/BUILD/bareos-17.2.3/platforms/systemd'
make[2]: Leaving directory '/builddir/build/BUILD/bareos-17.2.3/platforms/systemd'
make[1]: Leaving directory '/builddir/build/BUILD/bareos-17.2.3/platforms'
Configuration on Sat Nov  4 17:33:19 CET 2017:
   Host:                         x86_64-redhat-linux-gnu -- redhat Fedora release 27 (Twenty Seven)
   Bareos version:               Bareos 17.2.3 (14 Aug 2017)
   Distribution:                 redhat
   Source code location:         .
   Modify package list:          
   Install binaries:             /usr/bin
   Install system binaries:      /usr/sbin
   Install libraries:            /usr/lib64/bareos
   Install system config files:  /etc
   Install Bareos config files:  /etc/bareos
   Bareos config files:          /etc/bareos
   Scripts directory:            /usr/lib/bareos/scripts
   Archive directory:            /var/lib/bareos/storage
   Working directory:            /var/lib/bareos
   PID directory:                /var/lib/bareos
   Subsys directory:             /var/lock
   Man directory:                /usr/share/man
   Data directory:               /usr/share
   Backend directory:            /usr/lib64/bareos/backends
   Plugin directory:             /usr/lib64/bareos/plugins
   C Compiler:                   gcc 7.2.1
   C++ Compiler:                 /usr/lib64/ccache/g++ 7.2.1
   Compiler flags:                -O2 -g -pipe -Wall -Werror=format-security -Wp,-D_FORTIFY_SOURCE=2 -fexceptions -fstack-protector-strong --param=ssp-buffer-size=4 -grecord-gcc-switches -specs=/usr/lib/rpm/redhat/redhat-hardened-cc1 -m64 -mtune=generic -fno-strict-aliasing -fno-exceptions
   Linker flags:                  -Wl,-z,relro -specs=/usr/lib/rpm/redhat/redhat-hardened-ld
   Libraries:                    -lpthread -ldl 
   Statically Linked Tools:      no
   Statically Linked FD:         no
   Statically Linked SD:         no
   Statically Linked DIR:        no
   Statically Linked CONS:       no
   Database backends:            PostgreSQL MySQL SQLite3
   Database port:                 
   Database name:                bareos
   Database user:                bareos
   Database version:             2171
   Job Output Email:             root@localhost
   Traceback Email:              root@localhost
   SMTP Host Address:            localhost
   Director Port:                9101
   File daemon Port:             9102
   Storage daemon Port:          9103
   Director User:                bareos
   Director Group:               bareos
   Storage Daemon User:          bareos
   Storage DaemonGroup:          bareos
   File Daemon User:             root
   File Daemon Group:            bareos
   Large file support:           yes
   Bareos conio support:         no  -lreadline -ltinfo
   readline support:             yes
   TCP Wrappers support:         yes -lwrap
   TLS support:                  yes
   Encryption support:           yes
   OpenSSL support:              yes
   GNUTLS support:               no
   ZLIB support:                 yes
   LZO support:                  yes
   FASTLZ support:               yes
   JANSSON support:              yes
   LMDB support:                 yes
   NDMP support:                 yes
   enable-smartalloc:            yes
   enable-lockmgr:               no
   tray-monitor support:         yes
   client-only:                  no
   build-dird:                   yes
   build-stored:                 yes
   Plugin support:               yes
   AFS support:                  no
   ACL support:                  yes
   XATTR support:                yes
   SCSI Crypto support:          yes
   GLUSTERFS support:            yes
   DROPLET support:              no
   CEPH RADOS support:           yes
   RADOS striping support:       yes
   CEPHFS support:               yes
   ELASTO support:               no
   Python support:               yes -lpython2.7 -lpthread -ldl -lutil -lm -lutil -lrt 
   systemd support:              yes /usr/lib/systemd/system
   Batch insert enabled:         PostgreSQL MySQL SQLite3
   cmocka support:               yes
  
+ /usr/bin/make -O -j2
/usr/bin/make -C src
make[1]: Nothing to be done for 'first_rule'.
/usr/bin/make -C scripts
scripts/git-info.sh build/
skipped: git not available
/usr/bin/cp -p config.out build/
/usr/bin/make -C src/lib
make[1]: Nothing to be done for 'first_rule'.
/usr/bin/make -C src/lmdb
make[1]: Entering directory '/builddir/build/BUILD/bareos-17.2.3/src/lib'
Compiling address_conf.c
make[1]: Leaving directory '/builddir/build/BUILD/bareos-17.2.3/src/lib'
make[1]: Entering directory '/builddir/build/BUILD/bareos-17.2.3/src/lib'
Compiling alist.c
make[1]: Leaving directory '/builddir/build/BUILD/bareos-17.2.3/src/lib'
make[1]: Entering directory '/builddir/build/BUILD/bareos-17.2.3/src/lib'
Compiling attr.c
make[1]: Leaving directory '/builddir/build/BUILD/bareos-17.2.3/src/lib'
make[1]: Entering directory '/builddir/build/BUILD/bareos-17.2.3/src/lib'
Compiling attribs.c
make[1]: Leaving directory '/builddir/build/BUILD/bareos-17.2.3/src/lib'
make[1]: Entering directory '/builddir/build/BUILD/bareos-17.2.3/src/lib'
Compiling base64.c
make[1]: Leaving directory '/builddir/build/BUILD/bareos-17.2.3/src/lib'
make[1]: Entering directory '/builddir/build/BUILD/bareos-17.2.3/src/lib'
Compiling berrno.c
make[1]: Leaving directory '/builddir/build/BUILD/bareos-17.2.3/src/lib'
make[1]: Entering directory '/builddir/build/BUILD/bareos-17.2.3/src/lib'
Compiling bget_msg.c
make[1]: Leaving directory '/builddir/build/BUILD/bareos-17.2.3/src/lib'
make[1]: Entering directory '/builddir/build/BUILD/bareos-17.2.3/src/lib'
Compiling binflate.c
make[1]: Leaving directory '/builddir/build/BUILD/bareos-17.2.3/src/lib'
make[1]: Entering directory '/builddir/build/BUILD/bareos-17.2.3/src/lmdb'
Compiling mdb.c
make[1]: Leaving directory '/builddir/build/BUILD/bareos-17.2.3/src/lmdb'
make[1]: Entering directory '/builddir/build/BUILD/bareos-17.2.3/src/lib'
Compiling bnet_server_tcp.c
make[1]: Leaving directory '/builddir/build/BUILD/bareos-17.2.3/src/lib'
make[1]: Entering directory '/builddir/build/BUILD/bareos-17.2.3/src/lmdb'
Compiling midl.c
make[1]: Leaving directory '/builddir/build/BUILD/bareos-17.2.3/src/lmdb'
make[1]: Entering directory '/builddir/build/BUILD/bareos-17.2.3/src/lmdb'
Making libbareoslmdb.la ...
/builddir/build/BUILD/bareos-17.2.3/libtool --silent --tag=CC --mode=link gcc   -Wl,-z,relro -specs=/usr/lib/rpm/redhat/redhat-hardened-ld -o libbareoslmdb.la mdb.lo midl.lo -export-dynamic -rpath /usr/lib64/bareos -release 17.2.3 -lpthread -ldl 
make[1]: Leaving directory '/builddir/build/BUILD/bareos-17.2.3/src/lmdb'
make[1]: Entering directory '/builddir/build/BUILD/bareos-17.2.3/src/lmdb'
==== Make of lib is good ====
 
make[1]: Leaving directory '/builddir/build/BUILD/bareos-17.2.3/src/lmdb'
/usr/bin/make -C src/ndmp
make[1]: Entering directory '/builddir/build/BUILD/bareos-17.2.3/src/ndmp'
rpcgen -C -M ndmp0.x
make[1]: Leaving directory '/builddir/build/BUILD/bareos-17.2.3/src/ndmp'
make[1]: Entering directory '/builddir/build/BUILD/bareos-17.2.3/src/ndmp'
rpcgen -C -M ndmp0.x
make[1]: Leaving directory '/builddir/build/BUILD/bareos-17.2.3/src/ndmp'
make[1]: Entering directory '/builddir/build/BUILD/bareos-17.2.3/src/ndmp'
rpcgen -C -M ndmp2.x
make[1]: Leaving directory '/builddir/build/BUILD/bareos-17.2.3/src/ndmp'
make[1]: Entering directory '/builddir/build/BUILD/bareos-17.2.3/src/ndmp'
rpcgen -C -M ndmp2.x
make[1]: Leaving directory '/builddir/build/BUILD/bareos-17.2.3/src/ndmp'
make[1]: Entering directory '/builddir/build/BUILD/bareos-17.2.3/src/ndmp'
rpcgen -C -M ndmp3.x
make[1]: Leaving directory '/builddir/build/BUILD/bareos-17.2.3/src/ndmp'
make[1]: Entering directory '/builddir/build/BUILD/bareos-17.2.3/src/ndmp'
rpcgen -C -M ndmp3.x
make[1]: Leaving directory '/builddir/build/BUILD/bareos-17.2.3/src/ndmp'
make[1]: Entering directory '/builddir/build/BUILD/bareos-17.2.3/src/ndmp'
rpcgen -C -M ndmp4.x
make[1]: Leaving directory '/builddir/build/BUILD/bareos-17.2.3/src/ndmp'
make[1]: Entering directory '/builddir/build/BUILD/bareos-17.2.3/src/ndmp'
rpcgen -C -M ndmp4.x
make[1]: Leaving directory '/builddir/build/BUILD/bareos-17.2.3/src/ndmp'
make[1]: Entering directory '/builddir/build/BUILD/bareos-17.2.3/src/ndmp'
rpcgen -C -M ndmp9.x
make[1]: Leaving directory '/builddir/build/BUILD/bareos-17.2.3/src/ndmp'
make[1]: Entering directory '/builddir/build/BUILD/bareos-17.2.3/src/ndmp'
rpcgen -C -M ndmp9.x
make[1]: Leaving directory '/builddir/build/BUILD/bareos-17.2.3/src/ndmp'
make[1]: Entering directory '/builddir/build/BUILD/bareos-17.2.3/src/ndmp'
Compiling ndmp_translate.c
make[1]: Leaving directory '/builddir/build/BUILD/bareos-17.2.3/src/ndmp'
make[1]: Entering directory '/builddir/build/BUILD/bareos-17.2.3/src/ndmp'
Compiling ndmp0_enum_strs.c
make[1]: Leaving directory '/builddir/build/BUILD/bareos-17.2.3/src/ndmp'
make[1]: Entering directory '/builddir/build/BUILD/bareos-17.2.3/src/ndmp'
Compiling ndmp0_pp.c
make[1]: Leaving directory '/builddir/build/BUILD/bareos-17.2.3/src/ndmp'
make[1]: Entering directory '/builddir/build/BUILD/bareos-17.2.3/src/ndmp'
Compiling ndmp0_xdr.c
make[1]: Leaving directory '/builddir/build/BUILD/bareos-17.2.3/src/ndmp'
make[1]: Entering directory '/builddir/build/BUILD/bareos-17.2.3/src/ndmp'
Compiling ndmp0_xmt.c
make[1]: Leaving directory '/builddir/build/BUILD/bareos-17.2.3/src/ndmp'
make[1]: Entering directory '/builddir/build/BUILD/bareos-17.2.3/src/ndmp'
Compiling ndmp2_enum_strs.c
make[1]: Leaving directory '/builddir/build/BUILD/bareos-17.2.3/src/ndmp'
make[1]: Entering directory '/builddir/build/BUILD/bareos-17.2.3/src/ndmp'
Compiling ndmp2_pp.c
make[1]: Leaving directory '/builddir/build/BUILD/bareos-17.2.3/src/ndmp'
make[1]: Entering directory '/builddir/build/BUILD/bareos-17.2.3/src/ndmp'
Compiling ndmp2_translate.c
make[1]: Leaving directory '/builddir/build/BUILD/bareos-17.2.3/src/ndmp'
make[1]: Entering directory '/builddir/build/BUILD/bareos-17.2.3/src/ndmp'
Compiling ndmp2_xdr.c
make[1]: Leaving directory '/builddir/build/BUILD/bareos-17.2.3/src/ndmp'
make[1]: Entering directory '/builddir/build/BUILD/bareos-17.2.3/src/ndmp'
Compiling ndmp2_xmt.c
make[1]: Leaving directory '/builddir/build/BUILD/bareos-17.2.3/src/ndmp'
make[1]: Entering directory '/builddir/build/BUILD/bareos-17.2.3/src/ndmp'
Compiling ndmp3_enum_strs.c
make[1]: Leaving directory '/builddir/build/BUILD/bareos-17.2.3/src/ndmp'
make[1]: Entering directory '/builddir/build/BUILD/bareos-17.2.3/src/ndmp'
Compiling ndmp3_pp.c
make[1]: Leaving directory '/builddir/build/BUILD/bareos-17.2.3/src/ndmp'
make[1]: Entering directory '/builddir/build/BUILD/bareos-17.2.3/src/ndmp'
Compiling ndmp3_translate.c
make[1]: Leaving directory '/builddir/build/BUILD/bareos-17.2.3/src/ndmp'
make[1]: Entering directory '/builddir/build/BUILD/bareos-17.2.3/src/ndmp'
Compiling ndmp3_xdr.c
make[1]: Leaving directory '/builddir/build/BUILD/bareos-17.2.3/src/ndmp'
make[1]: Entering directory '/builddir/build/BUILD/bareos-17.2.3/src/ndmp'
Compiling ndmp3_xmt.c
make[1]: Leaving directory '/builddir/build/BUILD/bareos-17.2.3/src/ndmp'
make[1]: Entering directory '/builddir/build/BUILD/bareos-17.2.3/src/ndmp'
Compiling ndmp4_enum_strs.c
make[1]: Leaving directory '/builddir/build/BUILD/bareos-17.2.3/src/ndmp'
make[1]: Entering directory '/builddir/build/BUILD/bareos-17.2.3/src/ndmp'
Compiling ndmp4_pp.c
make[1]: Leaving directory '/builddir/build/BUILD/bareos-17.2.3/src/ndmp'
make[1]: Entering directory '/builddir/build/BUILD/bareos-17.2.3/src/ndmp'
Compiling ndmp4_translate.c
make[1]: Leaving directory '/builddir/build/BUILD/bareos-17.2.3/src/ndmp'
make[1]: Entering directory '/builddir/build/BUILD/bareos-17.2.3/src/ndmp'
Compiling ndmp4_xdr.c
make[1]: Leaving directory '/builddir/build/BUILD/bareos-17.2.3/src/ndmp'
make[1]: Entering directory '/builddir/build/BUILD/bareos-17.2.3/src/ndmp'
Compiling ndmp4_xmt.c
make[1]: Leaving directory '/builddir/build/BUILD/bareos-17.2.3/src/ndmp'
make[1]: Entering directory '/builddir/build/BUILD/bareos-17.2.3/src/ndmp'
Compiling ndmp9_enum_strs.c
make[1]: Leaving directory '/builddir/build/BUILD/bareos-17.2.3/src/ndmp'
make[1]: Entering directory '/builddir/build/BUILD/bareos-17.2.3/src/ndmp'
Compiling ndmp9_xdr.c
make[1]: Leaving directory '/builddir/build/BUILD/bareos-17.2.3/src/ndmp'
make[1]: Entering directory '/builddir/build/BUILD/bareos-17.2.3/src/ndmp'
Compiling ndmp9_xmt.c
make[1]: Leaving directory '/builddir/build/BUILD/bareos-17.2.3/src/ndmp'
make[1]: Entering directory '/builddir/build/BUILD/bareos-17.2.3/src/ndmp'
Compiling ndmprotocol.c
make[1]: Leaving directory '/builddir/build/BUILD/bareos-17.2.3/src/ndmp'
make[1]: Entering directory '/builddir/build/BUILD/bareos-17.2.3/src/ndmp'
Compiling ndml_agent.c
make[1]: Leaving directory '/builddir/build/BUILD/bareos-17.2.3/src/ndmp'
make[1]: Entering directory '/builddir/build/BUILD/bareos-17.2.3/src/ndmp'
Compiling ndml_bstf.c
make[1]: Leaving directory '/builddir/build/BUILD/bareos-17.2.3/src/ndmp'
make[1]: Entering directory '/builddir/build/BUILD/bareos-17.2.3/src/ndmp'
Compiling ndml_chan.c
make[1]: Leaving directory '/builddir/build/BUILD/bareos-17.2.3/src/ndmp'
make[1]: Entering directory '/builddir/build/BUILD/bareos-17.2.3/src/ndmp'
Compiling ndml_config.c
make[1]: Leaving directory '/builddir/build/BUILD/bareos-17.2.3/src/ndmp'
make[1]: Entering directory '/builddir/build/BUILD/bareos-17.2.3/src/ndmp'
Compiling ndml_conn.c
make[1]: Leaving directory '/builddir/build/BUILD/bareos-17.2.3/src/ndmp'
make[1]: Entering directory '/builddir/build/BUILD/bareos-17.2.3/src/ndmp'
Compiling ndml_cstr.c
make[1]: Leaving directory '/builddir/build/BUILD/bareos-17.2.3/src/ndmp'
make[1]: Entering directory '/builddir/build/BUILD/bareos-17.2.3/src/ndmp'
Compiling ndml_fhdb.c
make[1]: Leaving directory '/builddir/build/BUILD/bareos-17.2.3/src/ndmp'
make[1]: Entering directory '/builddir/build/BUILD/bareos-17.2.3/src/ndmp'
Compiling ndml_fhh.c
make[1]: Leaving directory '/builddir/build/BUILD/bareos-17.2.3/src/ndmp'
make[1]: Entering directory '/builddir/build/BUILD/bareos-17.2.3/src/ndmp'
Compiling ndml_log.c
make[1]: Leaving directory '/builddir/build/BUILD/bareos-17.2.3/src/ndmp'
make[1]: Entering directory '/builddir/build/BUILD/bareos-17.2.3/src/ndmp'
Compiling ndml_md5.c
make[1]: Leaving directory '/builddir/build/BUILD/bareos-17.2.3/src/ndmp'
make[1]: Entering directory '/builddir/build/BUILD/bareos-17.2.3/src/ndmp'
Compiling ndml_media.c
make[1]: Leaving directory '/builddir/build/BUILD/bareos-17.2.3/src/ndmp'
make[1]: Entering directory '/builddir/build/BUILD/bareos-17.2.3/src/ndmp'
Compiling ndml_nmb.c
make[1]: Leaving directory '/builddir/build/BUILD/bareos-17.2.3/src/ndmp'
make[1]: Entering directory '/builddir/build/BUILD/bareos-17.2.3/src/ndmp'
Compiling ndml_scsi.c
make[1]: Leaving directory '/builddir/build/BUILD/bareos-17.2.3/src/ndmp'
make[1]: Entering directory '/builddir/build/BUILD/bareos-17.2.3/src/ndmp'
Compiling ndml_stzf.c
make[1]: Leaving directory '/builddir/build/BUILD/bareos-17.2.3/src/ndmp'
make[1]: Entering directory '/builddir/build/BUILD/bareos-17.2.3/src/ndmp'
Compiling ndml_util.c
make[1]: Leaving directory '/builddir/build/BUILD/bareos-17.2.3/src/ndmp'
make[1]: Entering directory '/builddir/build/BUILD/bareos-17.2.3/src/ndmp'
Compiling ndma_comm_dispatch.c
make[1]: Leaving directory '/builddir/build/BUILD/bareos-17.2.3/src/ndmp'
make[1]: Entering directory '/builddir/build/BUILD/bareos-17.2.3/src/ndmp'
Compiling ndma_comm_job.c
make[1]: Leaving directory '/builddir/build/BUILD/bareos-17.2.3/src/ndmp'
make[1]: Entering directory '/builddir/build/BUILD/bareos-17.2.3/src/ndmp'
Compiling ndma_comm_session.c
make[1]: Leaving directory '/builddir/build/BUILD/bareos-17.2.3/src/ndmp'
make[1]: Entering directory '/builddir/build/BUILD/bareos-17.2.3/src/ndmp'
Compiling ndma_comm_subr.c
make[1]: Leaving directory '/builddir/build/BUILD/bareos-17.2.3/src/ndmp'
make[1]: Entering directory '/builddir/build/BUILD/bareos-17.2.3/src/ndmp'
Compiling ndma_control.c
make[1]: Leaving directory '/builddir/build/BUILD/bareos-17.2.3/src/ndmp'
make[1]: Entering directory '/builddir/build/BUILD/bareos-17.2.3/src/ndmp'
Compiling ndma_cops_backreco.c
make[1]: Leaving directory '/builddir/build/BUILD/bareos-17.2.3/src/ndmp'
make[1]: Entering directory '/builddir/build/BUILD/bareos-17.2.3/src/ndmp'
Compiling ndma_cops_labels.c
make[1]: Leaving directory '/builddir/build/BUILD/bareos-17.2.3/src/ndmp'
make[1]: Entering directory '/builddir/build/BUILD/bareos-17.2.3/src/ndmp'
Compiling ndma_cops_query.c
make[1]: Leaving directory '/builddir/build/BUILD/bareos-17.2.3/src/ndmp'
make[1]: Entering directory '/builddir/build/BUILD/bareos-17.2.3/src/ndmp'
Compiling ndma_cops_robot.c
make[1]: Leaving directory '/builddir/build/BUILD/bareos-17.2.3/src/ndmp'
make[1]: Entering directory '/builddir/build/BUILD/bareos-17.2.3/src/ndmp'
Compiling ndma_ctrl_calls.c
make[1]: Leaving directory '/builddir/build/BUILD/bareos-17.2.3/src/ndmp'
make[1]: Entering directory '/builddir/build/BUILD/bareos-17.2.3/src/ndmp'
Compiling ndma_ctrl_conn.c
make[1]: Leaving directory '/builddir/build/BUILD/bareos-17.2.3/src/ndmp'
make[1]: Entering directory '/builddir/build/BUILD/bareos-17.2.3/src/ndmp'
Compiling ndma_ctrl_media.c
make[1]: Leaving directory '/builddir/build/BUILD/bareos-17.2.3/src/ndmp'
make[1]: Entering directory '/builddir/build/BUILD/bareos-17.2.3/src/ndmp'
Compiling ndma_ctrl_robot.c
make[1]: Leaving directory '/builddir/build/BUILD/bareos-17.2.3/src/ndmp'
make[1]: Entering directory '/builddir/build/BUILD/bareos-17.2.3/src/ndmp'
Compiling ndma_ctst_data.c
make[1]: Leaving directory '/builddir/build/BUILD/bareos-17.2.3/src/ndmp'
make[1]: Entering directory '/builddir/build/BUILD/bareos-17.2.3/src/ndmp'
Compiling ndma_ctst_mover.c
make[1]: Leaving directory '/builddir/build/BUILD/bareos-17.2.3/src/ndmp'
make[1]: Entering directory '/builddir/build/BUILD/bareos-17.2.3/src/ndmp'
Compiling ndma_ctst_subr.c
make[1]: Leaving directory '/builddir/build/BUILD/bareos-17.2.3/src/ndmp'
make[1]: Entering directory '/builddir/build/BUILD/bareos-17.2.3/src/ndmp'
Compiling ndma_ctst_tape.c
make[1]: Leaving directory '/builddir/build/BUILD/bareos-17.2.3/src/ndmp'
make[1]: Entering directory '/builddir/build/BUILD/bareos-17.2.3/src/ndmp'
Compiling ndma_data_fh.c
make[1]: Leaving directory '/builddir/build/BUILD/bareos-17.2.3/src/ndmp'
make[1]: Entering directory '/builddir/build/BUILD/bareos-17.2.3/src/ndmp'
Compiling ndma_data_pfe.c
make[1]: Leaving directory '/builddir/build/BUILD/bareos-17.2.3/src/ndmp'
make[1]: Entering directory '/builddir/build/BUILD/bareos-17.2.3/src/ndmp'
Compiling ndma_data.c
make[1]: Leaving directory '/builddir/build/BUILD/bareos-17.2.3/src/ndmp'
make[1]: Entering directory '/builddir/build/BUILD/bareos-17.2.3/src/ndmp'
Compiling ndma_image_stream.c
make[1]: Leaving directory '/builddir/build/BUILD/bareos-17.2.3/src/ndmp'
make[1]: Entering directory '/builddir/build/BUILD/bareos-17.2.3/src/ndmp'
Compiling ndma_listmgmt.c
make[1]: Leaving directory '/builddir/build/BUILD/bareos-17.2.3/src/ndmp'
make[1]: Entering directory '/builddir/build/BUILD/bareos-17.2.3/src/ndmp'
Compiling ndma_noti_calls.c
make[1]: Leaving directory '/builddir/build/BUILD/bareos-17.2.3/src/ndmp'
make[1]: Entering directory '/builddir/build/BUILD/bareos-17.2.3/src/ndmp'
Compiling ndma_robot.c
make[1]: Leaving directory '/builddir/build/BUILD/bareos-17.2.3/src/ndmp'
make[1]: Entering directory '/builddir/build/BUILD/bareos-17.2.3/src/ndmp'
Compiling ndma_robot_simulator.c
make[1]: Leaving directory '/builddir/build/BUILD/bareos-17.2.3/src/ndmp'
make[1]: Entering directory '/builddir/build/BUILD/bareos-17.2.3/src/ndmp'
Compiling ndma_tape.c
ndma_tape.c: In function 'ndmta_write_quantum':
ndma_tape.c:569:8: warning: 'xsr_count' may be used uninitialized in this function [-Wmaybe-uninitialized]
        ndmalogf (sess, 0, 6, "NDMP9_MTIO_BSR %lu", xsr_count);
        ^~~~~~~~~~~~~~~~~~~~~~~~~~~~~~~~~~~~~~~~~~~~~~~~~~~~~~
make[1]: Leaving directory '/builddir/build/BUILD/bareos-17.2.3/src/ndmp'
make[1]: Entering directory '/builddir/build/BUILD/bareos-17.2.3/src/ndmp'
Compiling ndma_tape_simulator.c
make[1]: Leaving directory '/builddir/build/BUILD/bareos-17.2.3/src/ndmp'
make[1]: Entering directory '/builddir/build/BUILD/bareos-17.2.3/src/ndmp'
Compiling md5c.c
make[1]: Leaving directory '/builddir/build/BUILD/bareos-17.2.3/src/ndmp'
make[1]: Entering directory '/builddir/build/BUILD/bareos-17.2.3/src/ndmp'
Compiling ndmos.c
make[1]: Leaving directory '/builddir/build/BUILD/bareos-17.2.3/src/ndmp'
In file included from ndmos_linux.c:72:0,
                 from ndmos.c:50:
ndmos_common.c: In function 'ndmos_sync_config_info':
ndmos_common.c:94:55: warning: '%s' directive output may be truncated writing 20 bytes into a region of size between 9 and 73 [-Wformat-truncation=]
  snprintf (osbuf, sizeof(osbuf), "%s (running %s from %s)",
                                                       ^~
In file included from /usr/include/stdio.h:862:0,
                 from ../ndmp/ndmos_linux.h:59,
                 from ../ndmp/ndmos.h:181,
                 from ../ndmp/ndmlib.h:41,
                 from ndmagents.h:98,
                 from ndmos.c:38:
/usr/include/bits/stdio2.h:64:10: note: '__builtin___snprintf_chk' output between 49 and 113 bytes into a destination of size 100
   return __builtin___snprintf_chk (__s, __n, __USE_FORTIFY_LEVEL - 1,
          ^~~~~~~~~~~~~~~~~~~~~~~~~~~~~~~~~~~~~~~~~~~~~~~~~~~~~~~~~~~~
        __bos (__s), __fmt, __va_arg_pack ());
        ~~~~~~~~~~~~~~~~~~~~~~~~~~~~~~~~~~~~~
make[1]: Entering directory '/builddir/build/BUILD/bareos-17.2.3/src/ndmp'
Compiling smc_api.c
make[1]: Leaving directory '/builddir/build/BUILD/bareos-17.2.3/src/ndmp'
make[1]: Entering directory '/builddir/build/BUILD/bareos-17.2.3/src/ndmp'
Compiling smc_parse.c
make[1]: Leaving directory '/builddir/build/BUILD/bareos-17.2.3/src/ndmp'
make[1]: Entering directory '/builddir/build/BUILD/bareos-17.2.3/src/ndmp'
Compiling smc_pp.c
make[1]: Leaving directory '/builddir/build/BUILD/bareos-17.2.3/src/ndmp'
make[1]: Entering directory '/builddir/build/BUILD/bareos-17.2.3/src/ndmp'
Compiling wraplib.c
make[1]: Leaving directory '/builddir/build/BUILD/bareos-17.2.3/src/ndmp'
make[1]: Entering directory '/builddir/build/BUILD/bareos-17.2.3/src/ndmp'
Making libbareosndmp.la ...
/builddir/build/BUILD/bareos-17.2.3/libtool --silent --tag=CC --mode=link gcc   -Wl,-z,relro -specs=/usr/lib/rpm/redhat/redhat-hardened-ld -o libbareosndmp.la ndmp_translate.lo ndmp0_enum_strs.lo ndmp0_pp.lo ndmp0_xdr.lo ndmp0_xmt.lo ndmp2_enum_strs.lo ndmp2_pp.lo ndmp2_translate.lo ndmp2_xdr.lo ndmp2_xmt.lo ndmp3_enum_strs.lo ndmp3_pp.lo ndmp3_translate.lo ndmp3_xdr.lo ndmp3_xmt.lo ndmp4_enum_strs.lo ndmp4_pp.lo ndmp4_translate.lo ndmp4_xdr.lo ndmp4_xmt.lo ndmp9_enum_strs.lo ndmp9_xdr.lo ndmp9_xmt.lo ndmprotocol.lo ndml_agent.lo ndml_bstf.lo ndml_chan.lo ndml_config.lo ndml_conn.lo ndml_cstr.lo ndml_fhdb.lo ndml_fhh.lo ndml_log.lo ndml_md5.lo ndml_media.lo ndml_nmb.lo ndml_scsi.lo ndml_stzf.lo ndml_util.lo ndma_comm_dispatch.lo ndma_comm_job.lo ndma_comm_session.lo ndma_comm_subr.lo ndma_control.lo ndma_cops_backreco.lo ndma_cops_labels.lo ndma_cops_query.lo ndma_cops_robot.lo ndma_ctrl_calls.lo ndma_ctrl_conn.lo ndma_ctrl_media.lo ndma_ctrl_robot.lo ndma_ctst_data.lo ndma_ctst_mover.lo ndma_ctst_subr.lo ndma_ctst_tape.lo ndma_data_fh.lo ndma_data_pfe.lo ndma_data.lo ndma_image_stream.lo ndma_listmgmt.lo ndma_noti_calls.lo ndma_robot.lo ndma_robot_simulator.lo ndma_tape.lo ndma_tape_simulator.lo md5c.lo ndmos.lo smc_api.lo smc_parse.lo smc_pp.lo wraplib.lo -export-dynamic -rpath /usr/lib64/bareos -release 17.2.3 
make[1]: Leaving directory '/builddir/build/BUILD/bareos-17.2.3/src/ndmp'
make[1]: Entering directory '/builddir/build/BUILD/bareos-17.2.3/src/ndmp'
==== Make of lib is good ====
 
make[1]: Leaving directory '/builddir/build/BUILD/bareos-17.2.3/src/ndmp'
/usr/bin/make -C manpages
make[1]: Nothing to be done for 'all'.
/usr/bin/make -C platforms
make[2]: Nothing to be done for 'nothing'.
make[2]: Nothing to be done for 'nothing'.
make[1]: Entering directory '/builddir/build/BUILD/bareos-17.2.3/src/lib'
Compiling bnet.c
make[1]: Leaving directory '/builddir/build/BUILD/bareos-17.2.3/src/lib'
make[1]: Entering directory '/builddir/build/BUILD/bareos-17.2.3/src/lib'
Compiling breg.c
make[1]: Leaving directory '/builddir/build/BUILD/bareos-17.2.3/src/lib'
make[1]: Entering directory '/builddir/build/BUILD/bareos-17.2.3/src/lib'
Compiling bpipe.c
make[1]: Leaving directory '/builddir/build/BUILD/bareos-17.2.3/src/lib'
make[1]: Entering directory '/builddir/build/BUILD/bareos-17.2.3/src/lib'
Compiling bsnprintf.c
make[1]: Leaving directory '/builddir/build/BUILD/bareos-17.2.3/src/lib'
make[1]: Entering directory '/builddir/build/BUILD/bareos-17.2.3/src/lib'
Compiling bsock.c
make[1]: Leaving directory '/builddir/build/BUILD/bareos-17.2.3/src/lib'
make[1]: Entering directory '/builddir/build/BUILD/bareos-17.2.3/src/lib'
Compiling bregex.c
make[1]: Leaving directory '/builddir/build/BUILD/bareos-17.2.3/src/lib'
make[1]: Entering directory '/builddir/build/BUILD/bareos-17.2.3/src/lib'
Compiling bsock_sctp.c
make[1]: Leaving directory '/builddir/build/BUILD/bareos-17.2.3/src/lib'
make[1]: Entering directory '/builddir/build/BUILD/bareos-17.2.3/src/lib'
Compiling bsock_udt.c
make[1]: Leaving directory '/builddir/build/BUILD/bareos-17.2.3/src/lib'
make[1]: Entering directory '/builddir/build/BUILD/bareos-17.2.3/src/lib'
Compiling bsock_tcp.c
make[1]: Leaving directory '/builddir/build/BUILD/bareos-17.2.3/src/lib'
make[1]: Entering directory '/builddir/build/BUILD/bareos-17.2.3/src/lib'
Compiling btime.c
make[1]: Leaving directory '/builddir/build/BUILD/bareos-17.2.3/src/lib'
make[1]: Entering directory '/builddir/build/BUILD/bareos-17.2.3/src/lib'
Compiling bsys.c
make[1]: Leaving directory '/builddir/build/BUILD/bareos-17.2.3/src/lib'
make[1]: Entering directory '/builddir/build/BUILD/bareos-17.2.3/src/lib'
Compiling btimers.c
make[1]: Leaving directory '/builddir/build/BUILD/bareos-17.2.3/src/lib'
make[1]: Entering directory '/builddir/build/BUILD/bareos-17.2.3/src/lib'
Compiling cbuf.c
make[1]: Leaving directory '/builddir/build/BUILD/bareos-17.2.3/src/lib'
make[1]: Entering directory '/builddir/build/BUILD/bareos-17.2.3/src/lib'
Compiling compression.c
make[1]: Leaving directory '/builddir/build/BUILD/bareos-17.2.3/src/lib'
make[1]: Entering directory '/builddir/build/BUILD/bareos-17.2.3/src/lib'
Compiling connection_pool.c
make[1]: Leaving directory '/builddir/build/BUILD/bareos-17.2.3/src/lib'
make[1]: Entering directory '/builddir/build/BUILD/bareos-17.2.3/src/lib'
Compiling crypto.c
make[1]: Leaving directory '/builddir/build/BUILD/bareos-17.2.3/src/lib'
make[1]: Entering directory '/builddir/build/BUILD/bareos-17.2.3/src/lib'
Compiling cram-md5.c
make[1]: Leaving directory '/builddir/build/BUILD/bareos-17.2.3/src/lib'
make[1]: Entering directory '/builddir/build/BUILD/bareos-17.2.3/src/lib'
Compiling crypto_gnutls.c
make[1]: Leaving directory '/builddir/build/BUILD/bareos-17.2.3/src/lib'
make[1]: Entering directory '/builddir/build/BUILD/bareos-17.2.3/src/lib'
Compiling crypto_cache.c
make[1]: Leaving directory '/builddir/build/BUILD/bareos-17.2.3/src/lib'
make[1]: Entering directory '/builddir/build/BUILD/bareos-17.2.3/src/lib'
Compiling crypto_none.c
make[1]: Leaving directory '/builddir/build/BUILD/bareos-17.2.3/src/lib'
make[1]: Entering directory '/builddir/build/BUILD/bareos-17.2.3/src/lib'
Compiling crypto_nss.c
make[1]: Leaving directory '/builddir/build/BUILD/bareos-17.2.3/src/lib'
make[1]: Entering directory '/builddir/build/BUILD/bareos-17.2.3/src/lib'
Compiling crypto_wrap.c
make[1]: Leaving directory '/builddir/build/BUILD/bareos-17.2.3/src/lib'
make[1]: Entering directory '/builddir/build/BUILD/bareos-17.2.3/src/lib'
Compiling daemon.c
make[1]: Leaving directory '/builddir/build/BUILD/bareos-17.2.3/src/lib'
make[1]: Entering directory '/builddir/build/BUILD/bareos-17.2.3/src/lib'
Compiling crypto_openssl.c
make[1]: Leaving directory '/builddir/build/BUILD/bareos-17.2.3/src/lib'
crypto_openssl.c:1625:13: warning: 'void openssl_update_static_mutex(int, int, const char*, int)' defined but not used [-Wunused-function]
 static void openssl_update_static_mutex (int mode, int i, const char *file, int line)
             ^~~~~~~~~~~~~~~~~~~~~~~~~~~
crypto_openssl.c:1610:13: warning: 'void openssl_destroy_dynamic_mutex(CRYPTO_dynlock_value*, const char*, int)' defined but not used [-Wunused-function]
 static void openssl_destroy_dynamic_mutex(struct CRYPTO_dynlock_value *dynlock, const char *file, int line)
             ^~~~~~~~~~~~~~~~~~~~~~~~~~~~~
crypto_openssl.c:1601:13: warning: 'void openssl_update_dynamic_mutex(int, CRYPTO_dynlock_value*, const char*, int)' defined but not used [-Wunused-function]
 static void openssl_update_dynamic_mutex(int mode, struct CRYPTO_dynlock_value *dynlock, const char *file, int line)
             ^~~~~~~~~~~~~~~~~~~~~~~~~~~~
crypto_openssl.c:1586:37: warning: 'CRYPTO_dynlock_value* openssl_create_dynamic_mutex(const char*, int)' defined but not used [-Wunused-function]
 static struct CRYPTO_dynlock_value *openssl_create_dynamic_mutex (const char *file, int line)
                                     ^~~~~~~~~~~~~~~~~~~~~~~~~~~~
crypto_openssl.c:1568:22: warning: 'long unsigned int get_openssl_thread_id()' defined but not used [-Wunused-function]
 static unsigned long get_openssl_thread_id(void)
                      ^~~~~~~~~~~~~~~~~~~~~
make[1]: Entering directory '/builddir/build/BUILD/bareos-17.2.3/src/lib'
Compiling devlock.c
make[1]: Leaving directory '/builddir/build/BUILD/bareos-17.2.3/src/lib'
make[1]: Entering directory '/builddir/build/BUILD/bareos-17.2.3/src/lib'
Compiling dlist.c
make[1]: Leaving directory '/builddir/build/BUILD/bareos-17.2.3/src/lib'
make[1]: Entering directory '/builddir/build/BUILD/bareos-17.2.3/src/lib'
Compiling fnmatch.c
make[1]: Leaving directory '/builddir/build/BUILD/bareos-17.2.3/src/lib'
make[1]: Entering directory '/builddir/build/BUILD/bareos-17.2.3/src/lib'
Compiling edit.c
make[1]: Leaving directory '/builddir/build/BUILD/bareos-17.2.3/src/lib'
make[1]: Entering directory '/builddir/build/BUILD/bareos-17.2.3/src/lib'
Compiling hmac.c
make[1]: Leaving directory '/builddir/build/BUILD/bareos-17.2.3/src/lib'
make[1]: Entering directory '/builddir/build/BUILD/bareos-17.2.3/src/lib'
Compiling guid_to_name.c
make[1]: Leaving directory '/builddir/build/BUILD/bareos-17.2.3/src/lib'
make[1]: Entering directory '/builddir/build/BUILD/bareos-17.2.3/src/lib'
Compiling htable.c
make[1]: Leaving directory '/builddir/build/BUILD/bareos-17.2.3/src/lib'
make[1]: Entering directory '/builddir/build/BUILD/bareos-17.2.3/src/lib'
Compiling jcr.c
make[1]: Leaving directory '/builddir/build/BUILD/bareos-17.2.3/src/lib'
make[1]: Entering directory '/builddir/build/BUILD/bareos-17.2.3/src/lib'
Compiling json.c
make[1]: Leaving directory '/builddir/build/BUILD/bareos-17.2.3/src/lib'
make[1]: Entering directory '/builddir/build/BUILD/bareos-17.2.3/src/lib'
Compiling md5.c
make[1]: Leaving directory '/builddir/build/BUILD/bareos-17.2.3/src/lib'
make[1]: Entering directory '/builddir/build/BUILD/bareos-17.2.3/src/lib'
Compiling lockmgr.c
make[1]: Leaving directory '/builddir/build/BUILD/bareos-17.2.3/src/lib'
make[1]: Entering directory '/builddir/build/BUILD/bareos-17.2.3/src/lib'
Compiling mem_pool.c
make[1]: Leaving directory '/builddir/build/BUILD/bareos-17.2.3/src/lib'
make[1]: Entering directory '/builddir/build/BUILD/bareos-17.2.3/src/lib'
Compiling mntent_cache.c
make[1]: Leaving directory '/builddir/build/BUILD/bareos-17.2.3/src/lib'
make[1]: Entering directory '/builddir/build/BUILD/bareos-17.2.3/src/lib'
Compiling message.c
make[1]: Leaving directory '/builddir/build/BUILD/bareos-17.2.3/src/lib'
make[1]: Entering directory '/builddir/build/BUILD/bareos-17.2.3/src/lib'
Compiling output_formatter.c
make[1]: Leaving directory '/builddir/build/BUILD/bareos-17.2.3/src/lib'
make[1]: Entering directory '/builddir/build/BUILD/bareos-17.2.3/src/lib'
Compiling passphrase.c
make[1]: Leaving directory '/builddir/build/BUILD/bareos-17.2.3/src/lib'
make[1]: Entering directory '/builddir/build/BUILD/bareos-17.2.3/src/lib'
Compiling path_list.c
make[1]: Leaving directory '/builddir/build/BUILD/bareos-17.2.3/src/lib'
make[1]: Entering directory '/builddir/build/BUILD/bareos-17.2.3/src/lib'
Compiling plugins.c
make[1]: Leaving directory '/builddir/build/BUILD/bareos-17.2.3/src/lib'
make[1]: Entering directory '/builddir/build/BUILD/bareos-17.2.3/src/lib'
Compiling poll.c
make[1]: Leaving directory '/builddir/build/BUILD/bareos-17.2.3/src/lib'
make[1]: Entering directory '/builddir/build/BUILD/bareos-17.2.3/src/lib'
Compiling priv.c
make[1]: Leaving directory '/builddir/build/BUILD/bareos-17.2.3/src/lib'
make[1]: Entering directory '/builddir/build/BUILD/bareos-17.2.3/src/lib'
Compiling queue.c
make[1]: Leaving directory '/builddir/build/BUILD/bareos-17.2.3/src/lib'
make[1]: Entering directory '/builddir/build/BUILD/bareos-17.2.3/src/lib'
Compiling rblist.c
make[1]: Leaving directory '/builddir/build/BUILD/bareos-17.2.3/src/lib'
make[1]: Entering directory '/builddir/build/BUILD/bareos-17.2.3/src/lib'
Compiling runscript.c
make[1]: Leaving directory '/builddir/build/BUILD/bareos-17.2.3/src/lib'
make[1]: Entering directory '/builddir/build/BUILD/bareos-17.2.3/src/lib'
Compiling rwlock.c
make[1]: Leaving directory '/builddir/build/BUILD/bareos-17.2.3/src/lib'
make[1]: Entering directory '/builddir/build/BUILD/bareos-17.2.3/src/lib'
Compiling scan.c
make[1]: Leaving directory '/builddir/build/BUILD/bareos-17.2.3/src/lib'
make[1]: Entering directory '/builddir/build/BUILD/bareos-17.2.3/src/lib'
Compiling scsi_crypto.c
make[1]: Leaving directory '/builddir/build/BUILD/bareos-17.2.3/src/lib'
make[1]: Entering directory '/builddir/build/BUILD/bareos-17.2.3/src/lib'
Compiling scsi_lli.c
make[1]: Leaving directory '/builddir/build/BUILD/bareos-17.2.3/src/lib'
make[1]: Entering directory '/builddir/build/BUILD/bareos-17.2.3/src/lib'
Compiling scsi_tapealert.c
make[1]: Leaving directory '/builddir/build/BUILD/bareos-17.2.3/src/lib'
make[1]: Entering directory '/builddir/build/BUILD/bareos-17.2.3/src/lib'
Compiling sellist.c
make[1]: Leaving directory '/builddir/build/BUILD/bareos-17.2.3/src/lib'
make[1]: Entering directory '/builddir/build/BUILD/bareos-17.2.3/src/lib'
Compiling serial.c
make[1]: Leaving directory '/builddir/build/BUILD/bareos-17.2.3/src/lib'
make[1]: Entering directory '/builddir/build/BUILD/bareos-17.2.3/src/lib'
Compiling sha1.c
make[1]: Leaving directory '/builddir/build/BUILD/bareos-17.2.3/src/lib'
make[1]: Entering directory '/builddir/build/BUILD/bareos-17.2.3/src/lib'
Compiling signal.c
make[1]: Leaving directory '/builddir/build/BUILD/bareos-17.2.3/src/lib'
make[1]: Entering directory '/builddir/build/BUILD/bareos-17.2.3/src/lib'
Compiling smartall.c
make[1]: Leaving directory '/builddir/build/BUILD/bareos-17.2.3/src/lib'
make[1]: Entering directory '/builddir/build/BUILD/bareos-17.2.3/src/lib'
Compiling tls_gnutls.c
make[1]: Leaving directory '/builddir/build/BUILD/bareos-17.2.3/src/lib'
make[1]: Entering directory '/builddir/build/BUILD/bareos-17.2.3/src/lib'
Compiling tls_none.c
make[1]: Leaving directory '/builddir/build/BUILD/bareos-17.2.3/src/lib'
make[1]: Entering directory '/builddir/build/BUILD/bareos-17.2.3/src/lib'
Compiling tls_nss.c
make[1]: Leaving directory '/builddir/build/BUILD/bareos-17.2.3/src/lib'
make[1]: Entering directory '/builddir/build/BUILD/bareos-17.2.3/src/lib'
Compiling tree.c
make[1]: Leaving directory '/builddir/build/BUILD/bareos-17.2.3/src/lib'
make[1]: Entering directory '/builddir/build/BUILD/bareos-17.2.3/src/lib'
Compiling tls_openssl.c
make[1]: Leaving directory '/builddir/build/BUILD/bareos-17.2.3/src/lib'
make[1]: Entering directory '/builddir/build/BUILD/bareos-17.2.3/src/lib'
Compiling util.c
make[1]: Leaving directory '/builddir/build/BUILD/bareos-17.2.3/src/lib'
make[1]: Entering directory '/builddir/build/BUILD/bareos-17.2.3/src/lib'
Compiling watchdog.c
make[1]: Leaving directory '/builddir/build/BUILD/bareos-17.2.3/src/lib'
make[1]: Entering directory '/builddir/build/BUILD/bareos-17.2.3/src/lib'
Compiling var.c
make[1]: Leaving directory '/builddir/build/BUILD/bareos-17.2.3/src/lib'
make[1]: Entering directory '/builddir/build/BUILD/bareos-17.2.3/src/lib'
Compiling workq.c
make[1]: Leaving directory '/builddir/build/BUILD/bareos-17.2.3/src/lib'
make[1]: Entering directory '/builddir/build/BUILD/bareos-17.2.3/src/lib'
Compiling ini.c
make[1]: Leaving directory '/builddir/build/BUILD/bareos-17.2.3/src/lib'
make[1]: Entering directory '/builddir/build/BUILD/bareos-17.2.3/src/lib'
Compiling lex.c
make[1]: Leaving directory '/builddir/build/BUILD/bareos-17.2.3/src/lib'
In file included from ../include/bareos.h:189:0,
                 from lex.c:29:
lex.c: In function 'LEX* lex_new_buffer(LEX*, void (*)(const char*, int, LEX*, const char*, ...), void (*)(const char*, int, LEX*, const char*, ...))':
../include/baconfig.h:587:71: warning: argument 1 null where non-null expected [-Wnonnull]
 #define bstrdup(str) strcpy((char *)b_malloc(__FILE__,__LINE__, strlen((str))+1), (str))
                                                                 ~~~~~~^~~~~~~
lex.c:259:16: note: in expansion of macro 'bstrdup'
    lf->fname = bstrdup(filename);
                ^~~~~~~
In file included from ../include/bareos.h:137:0,
                 from lex.c:29:
/usr/include/string.h:384:15: note: in a call to function 'size_t strlen(const char*)' declared here
 extern size_t strlen (const char *__s)
               ^~~~~~
In file included from ../include/bareos.h:189:0,
                 from lex.c:29:
../include/baconfig.h:587:28: warning: argument 2 null where non-null expected [-Wnonnull]
 #define bstrdup(str) strcpy((char *)b_malloc(__FILE__,__LINE__, strlen((str))+1), (str))
                      ~~~~~~^~~~~~~~~~~~~~~~~~~~~~~~~~~~~~~~~~~~~~~~~~~~~~~~~~~~~~~~~~~~~
lex.c:259:16: note: in expansion of macro 'bstrdup'
    lf->fname = bstrdup(filename);
                ^~~~~~~
In file included from ../include/bareos.h:137:0,
                 from lex.c:29:
/usr/include/string.h:121:14: note: in a call to function 'char* strcpy(char*, const char*)' declared here
 extern char *strcpy (char *__restrict __dest, const char *__restrict __src)
              ^~~~~~
make[1]: Entering directory '/builddir/build/BUILD/bareos-17.2.3/src/lib'
Compiling parse_bsr.c
make[1]: Leaving directory '/builddir/build/BUILD/bareos-17.2.3/src/lib'
make[1]: Entering directory '/builddir/build/BUILD/bareos-17.2.3/src/lib'
Compiling parse_conf.c
make[1]: Leaving directory '/builddir/build/BUILD/bareos-17.2.3/src/lib'
make[1]: Entering directory '/builddir/build/BUILD/bareos-17.2.3/src/lib'
Making libbareos.la ...
/builddir/build/BUILD/bareos-17.2.3/libtool --silent --tag=CXX --mode=link /usr/lib64/ccache/g++   -Wl,-z,relro -specs=/usr/lib/rpm/redhat/redhat-hardened-ld -o libbareos.la address_conf.lo alist.lo attr.lo attribs.lo base64.lo berrno.lo bget_msg.lo binflate.lo bnet_server_tcp.lo bnet.lo bpipe.lo breg.lo bregex.lo bsnprintf.lo bsock.lo bsock_sctp.lo bsock_tcp.lo bsock_udt.lo bsys.lo btime.lo btimers.lo cbuf.lo compression.lo connection_pool.lo cram-md5.lo crypto.lo crypto_cache.lo crypto_gnutls.lo crypto_none.lo crypto_nss.lo crypto_openssl.lo crypto_wrap.lo daemon.lo devlock.lo dlist.lo edit.lo fnmatch.lo guid_to_name.lo hmac.lo htable.lo jcr.lo json.lo lockmgr.lo md5.lo mem_pool.lo message.lo mntent_cache.lo output_formatter.lo passphrase.lo path_list.lo plugins.lo poll.lo priv.lo queue.lo rblist.lo runscript.lo rwlock.lo scan.lo scsi_crypto.lo scsi_lli.lo scsi_tapealert.lo sellist.lo serial.lo sha1.lo signal.lo smartall.lo tls_gnutls.lo tls_none.lo tls_nss.lo tls_openssl.lo tree.lo util.lo var.lo watchdog.lo workq.lo -export-dynamic -rpath /usr/lib64/bareos -release 17.2.3 \
                -lwrap  -lcap -lz -llzo2 -lfastlz -ljansson  -lssl -lcrypto  -lpthread -ldl  -ldl
make[1]: Leaving directory '/builddir/build/BUILD/bareos-17.2.3/src/lib'
make[1]: Entering directory '/builddir/build/BUILD/bareos-17.2.3/src/lib'
Compiling res.c
make[1]: Leaving directory '/builddir/build/BUILD/bareos-17.2.3/src/lib'
make[1]: Entering directory '/builddir/build/BUILD/bareos-17.2.3/src/lib'
Making libbareoscfg.la ...
/builddir/build/BUILD/bareos-17.2.3/libtool --silent --tag=CXX --mode=link /usr/lib64/ccache/g++   -Wl,-z,relro -specs=/usr/lib/rpm/redhat/redhat-hardened-ld -o libbareoscfg.la ini.lo lex.lo parse_bsr.lo parse_conf.lo res.lo -export-dynamic -rpath /usr/lib64/bareos -release 17.2.3 \
                -lpthread -ldl  -lbareos
libtool: warning: '/usr/lib/gcc/x86_64-redhat-linux/7/../../../../lib64/libfastlz.la' seems to be moved
make[1]: Leaving directory '/builddir/build/BUILD/bareos-17.2.3/src/lib'
make[1]: Entering directory '/builddir/build/BUILD/bareos-17.2.3/src/lib'
==== Make of lib is good ====
 
make[1]: Leaving directory '/builddir/build/BUILD/bareos-17.2.3/src/lib'
/usr/bin/make -C src/findlib
/usr/bin/make -C src/console
make[1]: Entering directory '/builddir/build/BUILD/bareos-17.2.3/src/findlib'
Compiling acl.c
make[1]: Leaving directory '/builddir/build/BUILD/bareos-17.2.3/src/findlib'
make[1]: Entering directory '/builddir/build/BUILD/bareos-17.2.3/src/console'
Compiling console.c
make[1]: Leaving directory '/builddir/build/BUILD/bareos-17.2.3/src/console'
make[1]: Entering directory '/builddir/build/BUILD/bareos-17.2.3/src/findlib'
Compiling attribs.c
make[1]: Leaving directory '/builddir/build/BUILD/bareos-17.2.3/src/findlib'
make[1]: Entering directory '/builddir/build/BUILD/bareos-17.2.3/src/console'
Compiling console_conf.c
make[1]: Leaving directory '/builddir/build/BUILD/bareos-17.2.3/src/console'
make[1]: Entering directory '/builddir/build/BUILD/bareos-17.2.3/src/findlib'
Compiling bfile.c
make[1]: Leaving directory '/builddir/build/BUILD/bareos-17.2.3/src/findlib'
make[1]: Entering directory '/builddir/build/BUILD/bareos-17.2.3/src/console'
/builddir/build/BUILD/bareos-17.2.3/libtool --silent --tag=CXX --mode=link /usr/lib64/ccache/g++ -Wl,-z,relro -specs=/usr/lib/rpm/redhat/redhat-hardened-ld -L../lib -L../cats -o bconsole console.o console_conf.o \
       -lbareoscfg -lbareos -lm -lreadline -ltinfo -lpthread -ldl   \
       
make[1]: Leaving directory '/builddir/build/BUILD/bareos-17.2.3/src/console'
make[1]: Entering directory '/builddir/build/BUILD/bareos-17.2.3/src/console'
==== Make of console is good ====
 
make[1]: Leaving directory '/builddir/build/BUILD/bareos-17.2.3/src/console'
/usr/bin/make -C src/plugins/filed
make[1]: Entering directory '/builddir/build/BUILD/bareos-17.2.3/src/findlib'
Compiling create_file.c
make[1]: Leaving directory '/builddir/build/BUILD/bareos-17.2.3/src/findlib'
make[1]: Entering directory '/builddir/build/BUILD/bareos-17.2.3/src/plugins/filed'
/builddir/build/BUILD/bareos-17.2.3/libtool --silent --tag=CXX --mode=compile /usr/lib64/ccache/g++   -O2 -g -pipe -Wall -Werror=format-security -Wp,-D_FORTIFY_SOURCE=2 -fexceptions -fstack-protector-strong --param=ssp-buffer-size=4 -grecord-gcc-switches -specs=/usr/lib/rpm/redhat/redhat-hardened-cc1 -m64 -mtune=generic -fno-strict-aliasing -fno-exceptions -fno-strict-aliasing -fno-exceptions -fno-rtti -fno-strict-aliasing -fno-exceptions -I. -I../.. -I../../include -I../../filed -c bpipe-fd.c
make[1]: Leaving directory '/builddir/build/BUILD/bareos-17.2.3/src/plugins/filed'
make[1]: Entering directory '/builddir/build/BUILD/bareos-17.2.3/src/findlib'
Compiling drivetype.c
make[1]: Leaving directory '/builddir/build/BUILD/bareos-17.2.3/src/findlib'
make[1]: Entering directory '/builddir/build/BUILD/bareos-17.2.3/src/findlib'
Compiling enable_priv.c
make[1]: Leaving directory '/builddir/build/BUILD/bareos-17.2.3/src/findlib'
make[1]: Entering directory '/builddir/build/BUILD/bareos-17.2.3/src/plugins/filed'
/builddir/build/BUILD/bareos-17.2.3/libtool --silent --tag=CXX --mode=compile /usr/lib64/ccache/g++   -O2 -g -pipe -Wall -Werror=format-security -Wp,-D_FORTIFY_SOURCE=2 -fexceptions -fstack-protector-strong --param=ssp-buffer-size=4 -grecord-gcc-switches -specs=/usr/lib/rpm/redhat/redhat-hardened-cc1 -m64 -mtune=generic -fno-strict-aliasing -fno-exceptions -fno-strict-aliasing -fno-exceptions -fno-rtti -fno-strict-aliasing -fno-exceptions -I. -I../.. -I../../include -I../../filed -c test-plugin-fd.c
make[1]: Leaving directory '/builddir/build/BUILD/bareos-17.2.3/src/plugins/filed'
make[1]: Entering directory '/builddir/build/BUILD/bareos-17.2.3/src/plugins/filed'
/builddir/build/BUILD/bareos-17.2.3/libtool --silent --tag=CXX --mode=compile /usr/lib64/ccache/g++   -O2 -g -pipe -Wall -Werror=format-security -Wp,-D_FORTIFY_SOURCE=2 -fexceptions -fstack-protector-strong --param=ssp-buffer-size=4 -grecord-gcc-switches -specs=/usr/lib/rpm/redhat/redhat-hardened-cc1 -m64 -mtune=generic -fno-strict-aliasing -fno-exceptions -fno-strict-aliasing -fno-exceptions -fno-rtti -fno-strict-aliasing -fno-exceptions -I. -I../.. -I../../include -I../../filed -c test-deltaseq-fd.c
make[1]: Leaving directory '/builddir/build/BUILD/bareos-17.2.3/src/plugins/filed'
make[1]: Entering directory '/builddir/build/BUILD/bareos-17.2.3/src/findlib'
Compiling find_one.c
make[1]: Leaving directory '/builddir/build/BUILD/bareos-17.2.3/src/findlib'
make[1]: Entering directory '/builddir/build/BUILD/bareos-17.2.3/src/findlib'
Compiling find.c
make[1]: Leaving directory '/builddir/build/BUILD/bareos-17.2.3/src/findlib'
make[1]: Entering directory '/builddir/build/BUILD/bareos-17.2.3/src/findlib'
Compiling fstype.c
make[1]: Leaving directory '/builddir/build/BUILD/bareos-17.2.3/src/findlib'
make[1]: Entering directory '/builddir/build/BUILD/bareos-17.2.3/src/findlib'
Compiling hardlink.c
make[1]: Leaving directory '/builddir/build/BUILD/bareos-17.2.3/src/findlib'
make[1]: Entering directory '/builddir/build/BUILD/bareos-17.2.3/src/plugins/filed'
/builddir/build/BUILD/bareos-17.2.3/libtool --silent --tag=CXX --mode=compile /usr/lib64/ccache/g++   -O2 -g -pipe -Wall -Werror=format-security -Wp,-D_FORTIFY_SOURCE=2 -fexceptions -fstack-protector-strong --param=ssp-buffer-size=4 -grecord-gcc-switches -specs=/usr/lib/rpm/redhat/redhat-hardened-cc1 -m64 -mtune=generic -fno-strict-aliasing -fno-exceptions -fno-strict-aliasing -fno-exceptions -fno-rtti -fno-strict-aliasing -fno-exceptions -I. -I../.. -I../../include -I../../filed -I/usr/include/python2.7 -I/usr/include/python2.7 -c python-fd.c
make[1]: Leaving directory '/builddir/build/BUILD/bareos-17.2.3/src/plugins/filed'
In file included from /usr/include/python2.7/pyconfig.h:6:0,
                 from /usr/include/python2.7/Python.h:8,
                 from python-fd.c:36:
/usr/include/python2.7/pyconfig-64.h:1221:0: warning: "_XOPEN_SOURCE" redefined
 #define _XOPEN_SOURCE 600
 
In file included from /usr/include/bits/libc-header-start.h:33:0,
                 from /usr/include/stdint.h:26,
                 from /usr/lib/gcc/x86_64-redhat-linux/7/include/stdint.h:9,
                 from ../../include/bareos.h:88,
                 from python-fd.c:31:
/usr/include/features.h:201:0: note: this is the location of the previous definition
 # define _XOPEN_SOURCE 700
 
In file included from python-fd.h:29:0,
                 from python-fd.c:158:
/usr/include/python2.7/structmember.h:51:0: warning: "T_STRING" redefined
 #define T_STRING        5
 
In file included from ../../lib/lib.h:43:0,
                 from ../../include/bareos.h:190,
                 from python-fd.c:31:
../../lib/lex.h:68:0: note: this is the location of the previous definition
 #define T_STRING                      121  /* string */
 
make[1]: Entering directory '/builddir/build/BUILD/bareos-17.2.3/src/plugins/filed'
/builddir/build/BUILD/bareos-17.2.3/libtool --silent --tag=CXX --mode=compile /usr/lib64/ccache/g++   -fno-strict-aliasing -fno-exceptions -I. -I../.. -I../../include -I../../filed  -c rados-fd.c
make[1]: Leaving directory '/builddir/build/BUILD/bareos-17.2.3/src/plugins/filed'
make[1]: Entering directory '/builddir/build/BUILD/bareos-17.2.3/src/findlib'
Compiling match.c
make[1]: Leaving directory '/builddir/build/BUILD/bareos-17.2.3/src/findlib'
make[1]: Entering directory '/builddir/build/BUILD/bareos-17.2.3/src/plugins/filed'
/builddir/build/BUILD/bareos-17.2.3/libtool --silent --tag=CXX --mode=compile /usr/lib64/ccache/g++   -fno-strict-aliasing -fno-exceptions -I. -I../.. -I../../include -I../../filed -I/usr/include/glusterfs -c gfapi-fd.c
make[1]: Leaving directory '/builddir/build/BUILD/bareos-17.2.3/src/plugins/filed'
make[1]: Entering directory '/builddir/build/BUILD/bareos-17.2.3/src/findlib'
Compiling mkpath.c
make[1]: Leaving directory '/builddir/build/BUILD/bareos-17.2.3/src/findlib'
make[1]: Entering directory '/builddir/build/BUILD/bareos-17.2.3/src/plugins/filed'
/builddir/build/BUILD/bareos-17.2.3/libtool --silent --tag=CXX --mode=compile /usr/lib64/ccache/g++   -fno-strict-aliasing -fno-exceptions -I. -I../.. -I../../include -I../../filed  -c cephfs-fd.c
cephfs-fd.c: In function 'bRC get_next_file_to_backup(bpContext*)':
cephfs-fd.c:470:97: error: cannot convert 'stat*' to 'ceph_statx*' for argument '4' to 'int ceph_readdirplus_r(ceph_mount_info*, ceph_dir_result*, dirent*, ceph_statx*, unsigned int, unsigned int, Inode**)'
       status = ceph_readdirplus_r(p_ctx->cmount, p_ctx->cdir, &p_ctx->de, &p_ctx->statp, &stmask);
                                                                                                 ^
cephfs-fd.c:476:19: error: 'ceph_stat' was not declared in this scope
          status = ceph_stat(p_ctx->cmount, p_ctx->cwd, &p_ctx->statp);
                   ^~~~~~~~~
cephfs-fd.c:476:19: note: suggested alternative: 'ceph_statx'
          status = ceph_stat(p_ctx->cmount, p_ctx->cwd, &p_ctx->statp);
                   ^~~~~~~~~
                   ceph_statx
cephfs-fd.c: In function 'bool cephfs_makedirs(plugin_ctx*, const char*)':
cephfs-fd.c:1186:14: error: 'ceph_lstat' was not declared in this scope
          if (ceph_lstat(p_ctx->cmount, new_directory.c_str(), &st) != 0) {
              ^~~~~~~~~~
cephfs-fd.c:1186:14: note: suggested alternative: 'ceph_statx'
          if (ceph_lstat(p_ctx->cmount, new_directory.c_str(), &st) != 0) {
              ^~~~~~~~~~
              ceph_statx
cephfs-fd.c: In function 'bRC createFile(bpContext*, restore_pkt*)':
cephfs-fd.c:1243:13: error: 'ceph_lstat' was not declared in this scope
    status = ceph_lstat(p_ctx->cmount, rp->ofname, &st);
             ^~~~~~~~~~
cephfs-fd.c:1243:13: note: suggested alternative: 'ceph_statx'
    status = ceph_lstat(p_ctx->cmount, rp->ofname, &st);
             ^~~~~~~~~~
             ceph_statx
make[1]: *** [Makefile:161: cephfs-fd.lo] Error 1
make[1]: Leaving directory '/builddir/build/BUILD/bareos-17.2.3/src/plugins/filed'
make: *** [GNUmakefile:167: src/plugins/filed] Error 2
make: *** Waiting for unfinished jobs....
make[1]: Entering directory '/builddir/build/BUILD/bareos-17.2.3/src/findlib'
Compiling savecwd.c
make[1]: Leaving directory '/builddir/build/BUILD/bareos-17.2.3/src/findlib'
make[1]: Entering directory '/builddir/build/BUILD/bareos-17.2.3/src/findlib'
Compiling shadowing.c
make[1]: Leaving directory '/builddir/build/BUILD/bareos-17.2.3/src/findlib'
make[1]: Entering directory '/builddir/build/BUILD/bareos-17.2.3/src/findlib'
Compiling xattr.c
make[1]: Leaving directory '/builddir/build/BUILD/bareos-17.2.3/src/findlib'
make[1]: Entering directory '/builddir/build/BUILD/bareos-17.2.3/src/findlib'
Making libbareosfind.la ...
/builddir/build/BUILD/bareos-17.2.3/libtool --silent --tag=CXX --mode=link /usr/lib64/ccache/g++   -Wl,-z,relro -specs=/usr/lib/rpm/redhat/redhat-hardened-ld -L../lib -o libbareosfind.la acl.lo attribs.lo bfile.lo create_file.lo drivetype.lo enable_priv.lo find_one.lo find.lo fstype.lo hardlink.lo match.lo mkpath.lo savecwd.lo shadowing.lo xattr.lo -export-dynamic -rpath /usr/lib64/bareos -release 17.2.3 -lacl    -lbareos
make[1]: Leaving directory '/builddir/build/BUILD/bareos-17.2.3/src/findlib'
libtool: warning: '/usr/lib/gcc/x86_64-redhat-linux/7/../../../../lib64/libfastlz.la' seems to be moved
make[1]: Entering directory '/builddir/build/BUILD/bareos-17.2.3/src/findlib'
==== Make of findlib is good ====
 
make[1]: Leaving directory '/builddir/build/BUILD/bareos-17.2.3/src/findlib'
Fehler: Fehler-Status beim Beenden von /var/tmp/rpm-tmp.g4Fum2 (%build)
Fehler beim Bauen des RPM:
    Fehler-Status beim Beenden von /var/tmp/rpm-tmp.g4Fum2 (%build)
Child return code was: 1
EXCEPTION: [Error()]
Traceback (most recent call last):
  File "/usr/lib/python3.6/site-packages/mockbuild/trace_decorator.py", line 96, in trace
    result = func(*args, **kw)
  File "/usr/lib/python3.6/site-packages/mockbuild/util.py", line 598, in do
    raise exception.Error("Command failed: \n # %s\n%s" % (command, output), child.returncode)
mockbuild.exception.Error: Command failed: 
 # /usr/bin/systemd-nspawn -q -M a926b695dacc4292ad036756d6871e61 -D /var/lib/mock/fedora-27-x86_64/root -a --private-network --setenv=TERM=vt100 --setenv=SHELL=/bin/bash --setenv=HOME=/builddir --setenv=HOSTNAME=mock --setenv=PATH=/usr/bin:/bin:/usr/sbin:/sbin --setenv=PROMPT_COMMAND=printf "\033]0;<mock-chroot>\007" --setenv=PS1=<mock-chroot> \s-\v\$  --setenv=LANG=de_DE.utf8 --setenv=CCACHE_DIR=/tmp/ccache --setenv=CCACHE_UMASK=002 -u mockbuild bash --login -c /usr/bin/rpmbuild -bb --target x86_64 --nodeps /builddir/build/SPECS/bareos.spec

build.log (99,514 bytes)   
tuxmaster

tuxmaster

2017-11-04 17:46

reporter  

installed_pkgs.log (54,767 bytes)   
glusterfs-3.12.1-2.fc27.x86_64 1506614247 2019184 8dd13e9ef68f20ee1d3829b3971e1c2a installed
perl-File-Path-2.15-1.fc27.noarch 1501511558 64888 a642c5858a9cbe0f9761993ed81231f5 installed
kernel-headers-4.13.9-300.fc27.x86_64 1508768917 4361180 95b5c5f0435f1217c431ec370bdc15e8 installed
device-mapper-event-libs-1.02.142-4.fc27.x86_64 1501805211 54676 edcededbaaa526ac788cff087613b337 installed
perl-threads-1:2.16-4.fc27.x86_64 1501844033 107520 84f6bf9f3e59c438886bec8fc29dc622 installed
fedora-repos-27-1.noarch 1508866915 4786 62a9984c7b9d8beb302ade1d9683cb65 installed
cronie-anacron-1.5.1-8.fc27.x86_64 1501702337 41824 7544449c4c7c1ab366cd308acf365b3d installed
perl-Data-Dumper-2.167-396.fc27.x86_64 1501836898 105479 2bd2445ca1cbcad4f184e27e4b51c0c2 installed
basesystem-11-4.fc27.noarch 1501041082 0 98a0571877b77ccb636de423b1af38e9 installed
lvm2-2.02.173-4.fc27.x86_64 1501805211 3035240 2f4f151f98283a64b76d72bc2a9461e4 installed
perl-Time-Local-1:1.250-394.fc27.noarch 1501239916 55018 b63d20137d087501209d11c1d045ca3c installed
glibc-2.26-15.fc27.x86_64 1508593974 14175098 35e184300f62208424a7fe974f639047 installed
libglvnd-gles-1:0.2.999-24.20170818git8d4d03f.fc27.x86_64 1503478479 124456 32e486910bd91a0f857d0659c2ce4e1b installed
perl-ExtUtils-Manifest-1.70-394.fc27.noarch 1501225810 86222 0f60db56daafb9cb9853bae0b15f38ca installed
pcre-8.41-1.fc27.2.x86_64 1501833619 515951 c289214f3504d0a53db5a238a6c311d2 installed
mesa-libGLU-devel-9.0.0-13.fc27.x86_64 1501809473 20768 9c185da2f31e17c04ecf8ac358e9da23 installed
perl-CPAN-Meta-Requirements-2.140-395.fc27.noarch 1501220353 70632 f00e8cff3419a749d6be0b1513c90a93 installed
info-6.4-5.fc27.x86_64 1501892586 366189 92554439f89dae48286d57f34981d7bc installed
at-3.1.20-6.fc27.x86_64 1501697189 116425 b99984f5ea2c3c5d7c9be157691d9924 installed
perl-Locale-Maketext-1.28-395.fc27.noarch 1501229836 174853 798a81dbf21f1900d2cbab4078b7711f installed
elfutils-libelf-0.170-1.fc27.x86_64 1501756032 936435 7bfb6ad1276d3ee2c196e702cc7a14f2 installed
redhat-lsb-languages-4.1-36.fc27.x86_64 1501864940 814 29d441db99992b2d0004a3188923f53a installed
perl-XML-SAX-Base-1.09-3.fc27.noarch 1501241401 177496 3bc2fa4bc3c73613d5417489e64997b3 installed
libstdc++-7.2.1-2.fc27.x86_64 1505486876 1880073 7c111db0a7b98fc9b773f1c2c74a2424 installed
sqlite-devel-3.20.1-1.fc27.x86_64 1504076536 539855 f3ae342b5e80599a1948ae95e70e4853 installed
perl-Data-OptList-0.110-5.fc27.noarch 1501223546 49862 800ac5e7a11bc225685363685cec01cc installed
mpfr-3.1.5-5.fc27.x86_64 1501815611 511465 a32c6c4d3bfbedfb238885a8b2d29f73 installed
python-rpm-macros-3-22.fc27.noarch 1502799812 2607 c937b55569513991b1dc256b3a5722f2 installed
perl-HTTP-Date-6.02-17.fc27.noarch 1501228224 19447 b368c7526acbfd787c735e46fa194e60 installed
lua-libs-5.3.4-5.fc27.x86_64 1501800684 242424 a9ee02dcfbd7a93904ed91ced79d1636 installed
ncurses-c++-libs-6.0-13.20170722.fc27.x86_64 1501818044 138400 8b308945ee424612950ac6529864f8bb installed
perl-Net-SSLeay-1.81-4.fc27.x86_64 1501842221 1134098 27250da6c35f5215cdf139f8c4e9c235 installed
libacl-2.2.52-18.fc27.x86_64 1501695337 36504 d71298ac88dc65d33fb22ea6270a618f installed
jansson-2.10-4.fc27.x86_64 1501755313 78470 21bbdc61532eaf36b8e212b85945e508 installed
perl-Sys-Syslog-0.35-396.fc27.x86_64 1501843201 96707 12cb5e79a2e6b7c3dab65f486e90a6d2 installed
p11-kit-0.23.8-1.fc27.x86_64 1502802023 1343407 f557dc9bc6dbb178d91b60f1c742a8ab installed
readline-devel-7.0-7.fc27.x86_64 1501864679 442546 fe029dcd49745eacd3fecf2b98a39075 installed
perl-Devel-Size-0.81-1.fc27.x86_64 1502370418 41995 575c14d311551ad8f5be352313851120 installed
expat-2.2.4-1.fc27.x86_64 1503303308 269285 f339ef6935767c340df412ddcd1e8080 installed
glusterfs-api-devel-3.12.1-2.fc27.x86_64 1506614247 42432 8b3a9f4e679fb62ced474b3df098904b installed
perl-Text-Unidecode-1.30-4.fc27.noarch 1501239658 459801 1bfe1091e43dbe4e932d8309c6074cc0 installed
unzip-6.0-36.fc27.x86_64 1501897800 411362 e5e63d8b8f37ca7708265c8ab1b831b0 installed
libfastlz-devel-0.1-7.6.fc26.x86_64 1507824255 108169 5a457257e95e723646cfff78b610d539 installed
perl-HTML-Tagset-3.20-31.fc27.noarch 1501227906 19049 fdb030383bda6cb2ea71c0115c4bad70 installed
audit-libs-2.7.8-1.fc27.x86_64 1505759767 276836 99e9f98e1525de63240a95d7bc0e3c09 installed
tcp_wrappers-devel-7.6-87.fc27.x86_64 1501891750 13278 07755b353b4986d70ea1aef44e34cc27 installed
perl-Pod-Escapes-1:1.07-394.fc27.noarch 1501235334 25732 fe128471ed1b72cf05c050120b1dd367 installed
libtasn1-4.12-3.fc27.x86_64 1501791512 163811 43a859ce47577bccc26277dc5d538676 installed
perl-podlators-4.09-394.fc27.noarch 1501242072 280356 1f2077ae19c8ed6b863a4f73fcddf7b8 installed
libsemanage-2.7-1.fc27.x86_64 1502264279 295639 b908db4597b6c230c3c3d47131378c60 installed
perl-IO-Compress-2.074-395.fc27.noarch 1501229950 809346 e2a9333e030e89a4abdb03240e62c15e installed
file-5.31-10.fc27.x86_64 1504886105 90206 02509c02babab5d82ea6380f07b1c980 installed
perl-Digest-SHA-1:5.98-1.fc27.x86_64 1507805612 111999 ec96d8d051395d402aaeabe2edb01564 installed
libksba-1.3.5-5.fc27.x86_64 1501786364 328655 31a5c6be23790a64b8bc66c11f972b83 installed
perl-Pod-LaTeX-0.61-301.fc27.noarch 1501235625 85948 545ac5cced3b734ff029c5a48db8611e installed
zstd-1.3.1-1.fc27.x86_64 1503278423 887711 651e811b955a58938cda6f1c419054a8 installed
perl-Pod-Checker-4:1.73-394.fc27.noarch 1501235375 50296 b0009083fda29efed4c17f8f92245478 installed
dwz-0.12-5.fc27.x86_64 1501708446 220991 47eebf460f2e53ca33ff79fc544a5227 installed
perl-Algorithm-Diff-1.1903-8.fc27.noarch 1501218715 110476 a7b6fdbb5738ce5e0b47711112b96945 installed
bzip2-1.0.6-24.fc27.x86_64 1501698887 89228 243e97a64d6a5ef4c28fa85d231860c8 installed
perl-IPC-Cmd-2:0.98-4.fc27.noarch 1501228666 86440 fcbc791bf3e34429f3df18c11f03971f installed
libgomp-7.2.1-2.fc27.x86_64 1505486876 284914 d8f098e0f5406c0ffdbd2f9053fffefe installed
perl-Math-BigInt-1:1.9998.11-4.fc27.noarch 1501230620 694983 725a2a0deb5c29219fa97249887e94a6 installed
elfutils-0.170-1.fc27.x86_64 1501756032 842669 30d5f173aa4aefe3487ef9a2f599b3cc installed
perl-Sub-Exporter-0.987-13.fc27.noarch 1501237580 142717 3670bdeee701960657b09563bbb1cf7c installed
openssl-libs-1:1.1.0f-9.fc27.x86_64 1501829154 3196739 4a94b292b09354e8e0ae45c899e9ef35 installed
perl-Try-Tiny-0.28-4.fc27.noarch 1501240186 65132 75203c1d642c39a80f245dea22a0e4fe installed
libmount-2.30.2-1.fc27.x86_64 1506069459 372066 9a7090583aed3c29cc57eb03d76cc666 installed
crontabs-1.11-15.20150630git.fc27.noarch 1501047800 21439 c5297c7ed86ef6d6c97e54846750e006 installed
libpwquality-1.4.0-3.fc27.x86_64 1501789497 377423 5a3077fb302c63362285b2b534a34526 installed
pcre-utf32-8.41-1.fc27.2.x86_64 1501833619 439391 994f5836a301b6e2b1f6ade478991de1 installed
python3-3.6.2-13.fc27.x86_64 1504270034 38968 18042cfc0736ffe790f29668150f797e installed
python3-pyparsing-2.1.10-4.fc27.noarch 1501255998 733715 2a6510a8024973d0df404a8f427c0ed4 installed
libbabeltrace-1.5.3-1.fc27.x86_64 1502314402 522611 e86df8bf71967dcdb995317608f36c22 installed
perl-ExtUtils-MakeMaker-1:7.30-2.fc27.noarch 1501226133 729472 0fb8c62a8539f552249ec6dd186bb441 installed
libutempter-1.1.6-11.fc27.x86_64 1501793063 49813 dbd7cfcd80ad0c323f2ec48390b75127 installed
perl-CPAN-2.18-395.fc27.noarch 1501220455 1818195 3ca7967a61f1361341ab9306a259d8d3 installed
libarchive-3.3.1-3.fc27.x86_64 1501778727 813386 311c444fdc63b9130725d08ce75941b0 installed
freetype-devel-2.8-6.fc27.x86_64 1507551554 2979371 1dc1c3aa612b6424a1e59b3587af86bb installed
gawk-4.1.4-7.fc27.x86_64 1505754892 2572503 48050330cd32703355c2dbe2ca42e59f installed
gtk-update-icon-cache-3.22.24-1.fc27.x86_64 1507142122 59029 8e47a0b6f53da6e1592b99006daea333 installed
guile-5:2.0.14-3.fc27.x86_64 1501750941 12049534 bfbd88afc4944cfdba7a692cab51b5cd installed
libcom_err-devel-1.43.5-2.fc27.x86_64 1502453303 17081 b36718a3f9bd7aaa26b5b92c34d0f86f installed
libipt-1.6.1-4.fc27.x86_64 1501785131 96831 78ea0fb550f50f7bc1aaa5675c91ed36 installed
gl-manpages-1.1-14.20161227.fc27.noarch 1501081186 1084006 4c8e3d4c765d156bee690ffc16c84414 installed
krb5-libs-1.15.2-2.fc27.x86_64 1506704248 2182440 1cf9e8bb096f044247faedf406e1e695 installed
qpdf-libs-6.0.0-10.fc27.x86_64 1502465177 872555 750e1a657d3cb20e33bddaf1dcfba26e installed
libpkgconf-1.3.9-1.fc27.x86_64 1505890594 58007 8c2c40ebf31c48c517ba233048ecce68 installed
perl-Net-HTTP-6.17-1.fc27.noarch 1504517489 76262 f775a70c36b32562d6112308e951c2e7 installed
libcurl-7.55.1-5.fc27.x86_64 1503924520 533616 50a79d55c60bcc72d040c0b81d74a694 installed
perl-HTML-Parser-3.72-9.fc27.x86_64 1501839569 227514 efbd96ec3b79fed384ed1f412984709a installed
rpm-4.14.0-2.fc27.x86_64 1507817895 2038023 e079455141a7a64011c17852ba0e7f0d installed
perl-libwww-perl-6.27-2.fc27.noarch 1506075255 514136 d63ae45bcca7a2b6775e1f0af688e623 installed
python-srpm-macros-3-22.fc27.noarch 1502799812 2238 4348a158a29a2f66ceea12941bf4d690 installed
libkadm5-1.15.2-2.fc27.x86_64 1506704248 221888 7a63f11539a74ff64ddf9d0547176b49 installed
go-srpm-macros-2-10.fc27.noarch 1501087448 798 0b8f4d32538d21f4ef93902b00bd4205 installed
libpciaccess-0.13.4-6.fc27.x86_64 1501788917 45105 f35158d146530d0241d0af419f7b36c0 installed
fedora-rpm-macros-26-3.fc27.noarch 1501059129 79 fbed3de52bd67ef0f3c8c016da92cafd installed
harfbuzz-1.4.8-1.fc27.x86_64 1502288879 680425 1925f4ef9e152e89ab2b41cc94bdfa1f installed
gcc-c++-7.2.1-2.fc27.x86_64 1505486876 27618072 24e490a06db99b11092f88cbe54375d1 installed
less-487-5.fc27.x86_64 1501775418 316890 8f950fdab2563e03c36f0ac3765fbe80 installed
perl-libs-4:5.26.1-401.fc27.x86_64 1506349264 6044374 7567f92e090571d4688787b67d585e28 installed
poppler-0.57.0-2.fc27.x86_64 1506334109 2795568 c05769885c17cdee62343685daf0dcb4 installed
libpng-2:1.6.31-1.fc27.x86_64 1501603540 217678 4be30c86ce557452d20da675bc5065ee installed
libX11-1.6.5-4.fc27.x86_64 1501615597 1317496 bc4536ed1a4ed68c7e5a8f793a325169 installed
glusterfs-libs-3.12.1-2.fc27.x86_64 1506614247 1306168 306b3a4bf57f3c9d198872da304f4434 installed
libXext-devel-1.3.3-7.fc27.x86_64 1501777052 101228 f0c1948a779812dc150639226ee60cd3 installed
dbus-libs-1:1.11.20-1.fc27.x86_64 1507105604 367056 4e085efe93b451ad370bf664610540b2 installed
libXfixes-devel-5.0.3-4.fc27.x86_64 1501777043 9249 4eef8e97b185c6f3c2b7b830b311715d installed
zlib-devel-1.2.11-4.fc27.x86_64 1501917779 146243 9f217186bc713fd04667f864ce214f8a installed
libXft-2.3.2-7.fc27.x86_64 1501777077 128805 a07f4918373616e9ecef6c7c43ab6f8d installed
python2-2.7.13-17.fc27.x86_64 1502889863 81258 2fc248cebf24eeb00fd1a938e22a8bda installed
libXxf86vm-1.1.4-6.fc27.x86_64 1501777760 25432 d9dab2b38b3a75c253158d6968e6168e installed
fontpackages-filesystem-1.44-19.fc27.noarch 1501061517 0 29bf9fdb3b9f31de07a776d5a1c4a485 installed
libXmu-1.1.2-7.fc27.x86_64 1501777496 170198 a426eb2ce08b1a22e80eb5970dde47e4 installed
libSM-devel-1.2.2-7.fc27.x86_64 1501776304 19271 e7478361f1da47dafd6c6ac95c497023 installed
libXrandr-devel-1.5.1-4.fc27.x86_64 1501777482 22370 dd46d48c0bd49d1cefdec4dcc47c09b6 installed
libwayland-server-1.14.0-1.fc27.x86_64 1502265038 80068 9a0136a3e96ed2b185e4ca102d50a271 installed
libXi-devel-1.7.9-4.fc27.x86_64 1501777089 129364 aeacd931a8d0d3d71f191e9c14420aa5 installed
openjpeg2-2.3.0-1.fc27.x86_64 1507213035 355252 c0ffdcb4ae00b98581c0cc5e205fe991 installed
urw-base35-bookman-fonts-20170801-2.fc27.noarch 1506422416 1028559 569d9cfd87b5302d7b35d683bdae6754 installed
groff-base-1.22.3-11.fc27.x86_64 1501748615 3873834 f8a86d72e60d116cf388fa4c47655e2a installed
urw-base35-nimbus-mono-ps-fonts-20170801-2.fc27.noarch 1506422416 762058 f0d8039369e499feccd7efb13c382b08 installed
emacs-filesystem-1:25.3-3.fc27.noarch 1505429044 0 b49a89d3f69d3a61402eec5320d0fd56 installed
urw-base35-p052-fonts-20170801-2.fc27.noarch 1506422416 1115196 5d25a1b0870dc482b4652cffcc467cbc installed
userspace-rcu-0.10.0-3.fc27.x86_64 1501898931 316143 c7bdff84a3ede179c6ba292aa148ded2 installed
ghostscript-core-9.20-14.fc27.x86_64 1507807681 22891867 4066a44c846247d315dcaad2fbcec5c0 installed
libaio-0.3.110-9.fc27.x86_64 1501777888 39270 f786261807c9be7d580222db5060e2e3 installed
gtk2-2.24.31-6.fc27.x86_64 1501749869 13507873 13224d0f864838e05de8077f2975a406 installed
libradosstriper1-1:12.2.1-1.fc27.x86_64 1506771159 1036576 f95bde9aa78fdd37ff8142e8e41604f1 installed
libtirpc-1.0.2-3.fc27.x86_64 1503409024 214575 69c310c45cce45e26320fa513eb45cdd installed
desktop-file-utils-0.23-5.fc27.x86_64 1501704799 243015 08051f9b2b793fef231c91a9c2db03ff installed
iptables-libs-1.6.1-4.fc27.x86_64 1501754634 120216 44314233a7ffb653a84e5f86f06157a2 installed
passwd-0.79-12.fc27.x86_64 1501832696 421492 69eed52022904d180b71d5f5a533fe7c installed
redhat-lsb-submod-security-4.1-36.fc27.x86_64 1501864940 0 647872a3bd24e2d4baed0ce5e4d7d18d installed
libXfont-1.5.2-5.fc27.x86_64 1507732262 345414 3b87a583a7b0ffd55cdb34178d17d5c0 installed
hostname-3.18-4.fc27.x86_64 1501752816 37579 05b223c1bc9d64f1dbe08a2c1128f01f installed
fontconfig-2.12.6-3.fc27.x86_64 1507204407 640073 30eacfe81395b14bf2a5b653b39e02f4 installed
qt-1:4.8.7-31.fc27.x86_64 1501864450 18848065 049f44914baf74afb71eac124e1cd716 installed
libpng-devel-2:1.6.31-1.fc27.x86_64 1501603540 883592 e0646fd52539e5abed7c9ac7549a3960 installed
acl-2.2.52-18.fc27.x86_64 1501695337 187959 3303c4ae7e190b77357fdfc28f2be879 installed
glusterfs-cli-3.12.1-2.fc27.x86_64 1506614247 499678 f09644b3541e3d74d66155b30b346bad installed
systemd-pam-234-8.fc27.x86_64 1506439858 276008 f9e27e449ca47631c97092b6ee091ede installed
perl-Errno-0:1.28-401.fc27.x86_64 1506349264 9495 b061e5339f69874811c46df4047ddbd9 installed
gpg-pubkey-f5282ee4-58ac92a3 1487704739 0 (none) installed
perl-parent-1:0.236-394.fc27.noarch 1501242105 8951 1e35b531c2fda04271d31661d1d84114 installed
publicsuffix-list-dafsa-20170828-1.fc27.noarch 1504493730 53898 0b00ecfbb3de38b03285a447c4c28cee installed
perl-Text-Tabs+Wrap-2013.0523-394.fc27.noarch 1501239611 24768 afb14b752371ed1b49112b241e8dd2a6 installed
pkgconf-m4-1.3.9-1.fc27.noarch 1505890594 12670 51673fd0551a95c5a29b6375940df585 installed
perl-threads-shared-1.57-4.fc27.x86_64 1501843927 77103 c7257c0bf7234aefa8d6e64ae1fc8986 installed
fedora-gpg-keys-27-1.noarch 1508866915 95604 21227f48299a0ea2330dc15a07c3136b installed
perl-IO-0:1.38-401.fc27.x86_64 1506349264 138957 27c5c77a5c6d6ef7ded5d6a549991f86 installed
fedora-release-27-1.noarch 1508866967 11664 dacd2c30abb08773aa31176d1f2870ec installed
perl-interpreter-4:5.26.1-401.fc27.x86_64 1506349264 14160752 b8041d9dbe0be53dfa4f578f6b51ddc5 installed
filesystem-3.3-3.fc27.x86_64 1501716777 0 20b8a7fffe512c719c740b7cc53a1737 installed
perl-File-Temp-0.230.400-394.fc27.noarch 1501226307 159185 c4b09c1649f76791ff6a71d4eea4f742 installed
ncurses-base-6.0-13.20170722.fc27.noarch 1501818044 268574 7a2ec721dc6b646f216981d3ebc1d65c installed
perl-version-6:0.99.18-5.fc27.x86_64 1501844074 126577 33ef4e3d5a136c0a0be1251f56b7ba37 installed
glibc-common-2.26-15.fc27.x86_64 1508593974 3607550 6bd03c9ce2d80069096e59d80f98d88d installed
perl-Compress-Raw-Zlib-2.074-396.fc27.x86_64 1501835857 144909 c99971ecfdd6b9ef019afa67da6cd88d installed
ncurses-libs-6.0-13.20170722.fc27.x86_64 1501818044 901800 467adf22c4ac282c64b9c0a2b80c03c4 installed
perl-Time-HiRes-1.9746-1.fc27.x86_64 1502977835 110817 4e18516a2e0fc7b54d780373261a758d installed
libsepol-2.7-1.fc27.x86_64 1502122692 744104 f74c7a2fba7847e8baf61a9489b432ff installed
perl-Storable-1:2.62-395.fc27.x86_64 1501843017 183909 295a96ce8ddd546bdca3839df5958af9 installed
pcre2-10.30-1.fc27.x86_64 1502797482 636286 a548dcf976b9ad579c2bee8bf131014f installed
perl-libnet-3.10-395.fc27.noarch 1501241780 277948 8a31437fa5f157d8720104fe8a7f482d installed
zlib-1.2.11-4.fc27.x86_64 1501917779 194551 66f1a0d5c0633989f067b4c297dad888 installed
perl-Module-Metadata-1.000033-394.fc27.noarch 1501231446 67672 16c4caf8435f1aa58f37a5858f8b2846 installed
bzip2-libs-1.0.6-24.fc27.x86_64 1501698887 73797 7523eea5cdf7e2fd97ce214caaf1de78 installed
perl-Digest-MD5-2.55-395.fc27.x86_64 1501837650 55770 3d4559665fcce756a5ee14d674123333 installed
gmp-1:6.1.2-6.fc27.x86_64 1501740037 632619 687421a657616b70ed24e383283ee0ef installed
perl-Locale-Maketext-Simple-1:0.21-401.fc27.noarch 1506349264 14015 bebb05840631c1174ca7bf2d20b6351e installed
libdb-5.3.28-26.fc27.x86_64 1501783307 1884024 82672bfff99f6d2350e84c9389e08f87 installed
perl-XML-NamespaceSupport-1.12-3.fc27.noarch 1501241285 46013 c62da0a06d1fe30640a3a74d7c936996 installed
readline-7.0-7.fc27.x86_64 1501864679 521597 ff427dd2536b64b483cbd44ddd662390 installed
perl-Params-Util-1.07-20.fc27.x86_64 1501842398 74085 0ffcaf5c9e82111d5567a02dc1210bf6 installed
libcap-2.25-7.fc27.x86_64 1501781733 109997 7bd83b03b59975a3bdb9f5d4234feee5 installed
perl-Module-Load-1:0.32-394.fc27.noarch 1501231423 14278 3c171610ae21db94f2a89506e7cb3d0f installed
nss-util-3.33.0-1.0.fc27.x86_64 1507029423 215684 d399aaeb5e0efb1c5e3b953938866f34 installed
perl-Test-Simple-1:1.302098-1.fc27.noarch 1507045587 1166228 16a6536f6a698012e283059b1eabc990 installed
grep-3.1-3.fc27.x86_64 1501748461 803253 1d8bf5086c93cb51e47574125e2c2d50 installed
perl-TimeDate-1:2.30-12.fc27.noarch 1501240081 95848 00115227f450f0cd591f698317b6fd03 installed
libzstd-1.3.1-1.fc27.x86_64 1503278423 391218 b8c575a261c02100533471eb0bd12292 installed
perl-File-Listing-6.04-16.fc27.noarch 1501226025 16459 768d2b88ec1f5616d60f41fd9e8874f2 installed
libffi-3.1-14.fc27.x86_64 1501784039 48492 e2aaa297ec5b4c70b4883d7cf605a2ed installed
perl-Module-Load-Conditional-0.68-394.fc27.noarch 1501231279 29263 3c062d58a2c2b9a89604b642a9b000d3 installed
libattr-2.4.47-21.fc27.x86_64 1501697288 20077 f4c5424b524fcee12bfc115f5999794e installed
perl-Class-ISA-0.36-1021.fc27.noarch 1501221438 12821 6b60c6ace79eadff915c416ab426ef7f installed
sed-4.4-3.fc27.x86_64 1501874924 731110 cceea9643a40211f2e780850a38bca63 installed
perl-File-CheckTree-4.42-300.fc27.noarch 1501225868 28853 f01064596a8c60b0c25ad096fe82c68e installed
libidn2-2.0.4-1.fc27.x86_64 1504115154 232312 a578388c185564cc765c91f191562a4b installed
perl-Module-Pluggable-2:5.2-6.fc27.noarch 1501231446 55118 fdf250d77d2e0ac38b7862d6b9a749b0 installed
libmpc-1.0.2-8.fc27.x86_64 1501786911 116632 aa47466a417adcc07ce07f2b1e8ce491 installed
perl-Compress-Bzip2-2.26-5.fc27.x86_64 1501835677 145271 41bed6d1ebe1adbeeef8165ce8197bf6 installed
file-libs-5.31-10.fc27.x86_64 1504886105 6059181 f5ed99cd6370f166f986dc51660ac7f6 installed
perl-Text-Glob-0.11-3.fc27.noarch 1501239424 8795 b9535f40754c0b6e10f8f8a1e24a7b05 installed
sqlite-libs-3.20.1-1.fc27.x86_64 1504076536 1066138 89b280c5eda016cba7860e9bc3e87536 installed
perl-ExtUtils-Command-1:7.30-2.fc27.noarch 1501226133 10072 b5a8111de45f2a78157ac74fb3623ea8 installed
libgcrypt-1.8.1-1.fc27.x86_64 1504619106 1245260 5d995a0549acaf3536c60d163902b2fd installed
perl-Text-Soundex-3.05-7.fc27.x86_64 1501843399 47741 6a353a99ae63f4eeacd59a1e2af029f8 installed
nss-softokn-freebl-3.33.0-1.0.fc27.x86_64 1507031615 579424 409ff3fbe7c4ede461b6d6894fe9af5e installed
perl-autodie-2.29-395.fc27.noarch 1501241629 215650 6df3de87cc24e524a169bdba6bd02704 installed
libcap-ng-0.7.8-5.fc27.x86_64 1501781804 50086 f1ebc6814ca11141dcc1b55e37784931 installed
perl-CPAN-Meta-YAML-0.018-395.fc27.noarch 1501220566 51691 52afc4e098ba4170a12d867f262cde4c installed
lz4-libs-1.8.0-1.fc27.x86_64 1503158878 86951 5b75eaf14fc6339375be06875ed4c4b2 installed
perl-Term-Cap-1.17-394.fc27.noarch 1501238062 29825 d190fb8fb0f0ae1e13639eed5077a90e installed
keyutils-libs-1.5.10-3.fc27.x86_64 1501759424 42998 a3901e2e8b681e9c2258e489ebd2e754 installed
perl-Pod-Simple-1:3.35-394.fc27.noarch 1501235503 543058 f7c4c1bb3baf7a8e1c62178f7c68d397 installed
p11-kit-trust-0.23.8-1.fc27.x86_64 1502802023 469361 a48fe3197cdb303a5f0b4cb86d2c6d2b installed
perl-Getopt-Long-1:2.50-3.fc27.noarch 1501226985 139695 cf98d8c53ed1e848f9314884f7255d83 installed
libusbx-1.0.21-4.fc27.x86_64 1501792719 142389 cb474c139b4e4895e25d8b0667db5b55 installed
perl-Pod-Perldoc-3.28-395.fc27.noarch 1501235582 168802 57487f7e616cb4434c66d7b8cae841db installed
nss-softokn-3.33.0-1.0.fc27.x86_64 1507031615 1531366 defabc712c8f4f877e66317c79049946 installed
perl-URI-1.72-1.fc27.noarch 1501058387 214741 19beb9ea354f65ade4d0937ed8c4251c installed
libmetalink-0.1.3-4.fc27.x86_64 1501786902 66880 dba87a7c3668df513aa6d28b39b7e694 installed
perl-Test-Harness-1:3.39-4.fc27.noarch 1501238545 578642 2a181bceb2f54caf6fafff609ab65a26 installed
cpp-7.2.1-2.fc27.x86_64 1505486876 25281764 090036991ef52355fe7493b8545d2133 installed
perl-Pod-Parser-1.63-395.fc27.noarch 1501235447 269422 9d6165ac70e45d9390ce34629fbb923b installed
libassuan-2.4.3-6.fc27.x86_64 1502135114 179027 c63d583b851eb943f3b2230b9297f882 installed
perl-Encode-Locale-1.05-8.fc27.noarch 1501225379 19753 5eee066968dd03988db8d614912644fe installed
tar-2:1.29-7.fc27.x86_64 1501891493 2742685 cae0b0b90e85cdbe34c9312452c3a48f installed
perl-NTLM-1.09-16.fc27.noarch 1501232647 32218 51960095f496d57ff5486ba69f89f3eb installed
xz-5.2.3-4.fc27.x86_64 1501913031 415895 da52d639304e5d69373879a5fb2c730e installed
perl-Pod-Plainer-1.04-6.fc27.noarch 1501235482 5179 6a743f61a4a8cb6c40940c32f592ce58 installed
libstdc++-devel-7.2.1-2.fc27.x86_64 1505486876 10642855 587f444dcef1a9930dd4c477a8ffab5f installed
perl-WWW-RobotRules-6.02-17.fc27.noarch 1501240742 25330 011528007d73604bad2fa3d6b29b22d0 installed
libdb-utils-5.3.28-26.fc27.x86_64 1501783307 340367 1ad358083df76cb7e9e2ac25116de371 installed
perl-Pod-Html-0:1.22.02-401.fc27.noarch 1506349264 36896 cde7bd98c1c7b0b99d821810c2db66af installed
isl-0.16.1-3.fc27.x86_64 1501754933 3090473 2a9b70952ccc4c4f12ae756e470ae0f1 installed
perl-IO-HTML-1.001-9.fc27.noarch 1501228248 42994 0b249fb50c5f299ffa8ceb952d4f8ec7 installed
libxml2-2.9.5-2.fc27.x86_64 1506076902 1736847 d16c00acae9d0b65b69f4b400946868a installed
perl-Text-Diff-1.44-5.fc27.noarch 1501239291 85361 6a20ae6577c1201d76d2e7fa18770d55 installed
diffutils-3.6-3.fc27.x86_64 1502298497 1356427 45abee738a78e055ac326a0dac88e994 installed
perl-ExtUtils-MM-Utils-1:7.30-2.fc27.noarch 1501226133 3195 150ba3f21690b5fcd528b4895f88d880 installed
cpio-2.12-6.fc27.x86_64 1501701875 961873 c7c4b845e0ccc0435463eba354ae05de installed
perl-Text-Template-1.47-3.fc27.noarch 1501239628 123847 3e3af540fedb7cff233e7790ba8b037c installed
coreutils-common-8.27-16.fc27.x86_64 1503408106 9514837 2995f60a7743ccb85f872df854638b20 installed
perl-Math-Complex-0:1.59-401.fc27.noarch 1506349264 88208 e94781ce5fba004fbb183c733da89b26 installed
elfutils-libs-0.170-1.fc27.x86_64 1501756032 746687 95b570368286a903c531d68aefb591d9 installed
perl-JSON-PP-1:2.94-4.fc27.noarch 1501228967 128539 2a9fd151c08dbee834dd1a5983fd5a93 installed
glibc-headers-2.26-15.fc27.x86_64 1508593974 2295564 957a062424c4fa21a003c8bb97b5b3fc installed
perl-Package-Generator-1.106-10.fc27.noarch 1501234405 30979 4a148a0f493c756006e08c62cccdb1e1 installed
ncurses-6.0-13.20170722.fc27.x86_64 1501818044 549419 700a116fb11ba5c6f1624b636a807159 installed
perl-File-Which-1.21-5.fc27.noarch 1501226344 24596 323cd30e099cb901c2e9c0ce5c747a01 installed
coreutils-8.27-16.fc27.x86_64 1503408106 5773848 26cd41010790e186ca4de298425d9917 installed
perl-Locale-Codes-3.54-1.fc27.noarch 1504516959 2351454 8d20eea87ebdddb78663ea6f46f16558 installed
libblkid-2.30.2-1.fc27.x86_64 1506069459 309432 1813b8e4d055d01ad6bc5fe0b56138b4 installed
perl-MRO-Compat-0.13-3.fc27.noarch 1501230094 25882 c72067b8976a7fbea1329f6a7d3f991f installed
gzip-1.8-4.fc27.x86_64 1501750876 332387 ecff2b0c26246c954d36535f07f647a8 installed
perl-Software-License-0.103012-7.fc27.noarch 1501236866 427410 e5701eb219ff243cfa3957a93bbb4539 installed
pam-1.3.0-6.fc27.x86_64 1503327423 2623797 3f4695847be7215e843c66205d2ad354 installed
liblockfile-1.09-7.fc27.x86_64 1501786035 44897 9c0032758def9c4e6274a92be16c567c installed
binutils-2.29-6.fc27.x86_64 1501698949 25203343 824436216998374d2bbe32dad3a2fcb8 installed
esmtp-1.2-8.fc27.x86_64 1501714376 102923 abb4173568d6c631249d087c6235bd50 installed
python3-setuptools-36.2.0-7.fc27.noarch 1503217307 2164682 ad809870e99a326c6a9c963cde9adc51 installed
pcre-utf16-8.41-1.fc27.2.x86_64 1501833619 459879 3ab5eb3a29a3bde867fcde80ea4e4e9d installed
python3-libs-3.6.2-13.fc27.x86_64 1504270034 34851742 c75ded3f5b0860605b3f69963ab7eb04 installed
pcre-devel-8.41-1.fc27.2.x86_64 1501833619 1737695 1175262c3507178de81241add76dadf1 installed
glib2-2.54.1-1.fc27.x86_64 1507318407 11934104 cc100f0ff21ef9329e3d79ee4996c8ea installed
systemtap-sdt-devel-3.2-0.20170516gitc67d8f274b21.fc27.x86_64 1502438457 174566 ed6adf3dc1321789fac2f9cd9cef133b installed
libfdisk-2.30.2-1.fc27.x86_64 1506069459 441058 08045f1d74abff1a7a352c5a3c79b339 installed
perl-ExtUtils-Install-2.14-3.fc27.noarch 1501225817 87643 c3e791461258ea0bdd53ec5fa066090b installed
shadow-utils-2:4.5-4.fc27.x86_64 1502701873 3821564 2a331001719779f37b9ad15f0959d3c2 installed
perl-ExtUtils-CBuilder-1:0.280226-2.fc27.noarch 1501225790 98552 65fb3b222e4fa5cc82a5e6da59d402da installed
nss-pem-1.0.3-5.fc27.x86_64 1501822176 196491 7d77e32f72f9bd48cb5e1839386ff980 installed
perl-Module-Build-2:0.42.24-4.fc27.noarch 1501231154 669062 66b3d806f1624309a0f6a98cf505051c installed
nss-sysinit-3.33.0-1.0.fc27.x86_64 1507040923 14003 e7a64ca1c63f5bb445d688788e81980d installed
libfastlz-0.1-7.6.fc26.x86_64 1507824255 79943 febf411df33463dd32b4fa59ba473529 installed
libssh2-1.8.0-5.fc27.x86_64 1505212524 190336 ed1a6d5c3161fa1242242ffab577e443 installed
bzip2-devel-1.0.6-24.fc27.x86_64 1501698887 391358 206b185a8bc6dbc9105cee5e306ead9f installed
libsigsegv-2.11-3.fc27.x86_64 1501790860 44418 0cc2daf5886637a60201e1c7971d964d installed
fontconfig-devel-2.12.6-3.fc27.x86_64 1507204407 106857 abf9c2f8e8a0b0e60c5ed7b5f96b0d84 installed
libatomic_ops-7.4.6-3.fc27.x86_64 1501778961 66155 d2cf327a21c0edc9bc2b72a48076d99c installed
libtool-ltdl-2.4.6-20.fc27.x86_64 1501793513 67794 bac3e936e61a5e3b39772837bcdc4b44 installed
make-1:4.2.1-4.fc27.x86_64 1501806773 1430448 577d611e8801535fc0d923d7169e94cf installed
ima-evm-utils-1.0-1.fc27.x86_64 1504727701 134417 49e94ac6bb1498c21908a0102bc4be74 installed
gdb-headless-8.0.1-26.fc27.x86_64 1505203051 10684766 d7069bae70cd59e30f67dade83095098 installed
libverto-0.2.6-11.fc27.x86_64 1502119116 22796 9b17540080d8ebed0a8d23aac1b7750d installed
cyrus-sasl-lib-2.1.26-34.fc27.x86_64 1501703654 396831 9c14b446d31a2a133c7a0ae7fa3e95aa installed
gnupg2-2.2.0-1.fc27.x86_64 1504623348 8987316 7fb8d2749fef798b34d209a5587f1f33 installed
pkgconf-1.3.9-1.fc27.x86_64 1505890594 55092 0a7909ae48f018975625208739fb07d5 installed
libnghttp2-1.25.0-1.fc27.x86_64 1503073490 158668 4a1ebb209c258fd429b4242610d219c6 installed
curl-7.55.1-5.fc27.x86_64 1503924520 815687 ffb67912daeb233d8ef7642892273350 installed
rpm-libs-4.14.0-2.fc27.x86_64 1507817895 690656 d9769c77a18e99b104914eda94b12c64 installed
rpm-build-libs-4.14.0-2.fc27.x86_64 1507817895 205648 c382ad225c1e2a916566e359eabb0760 installed
qt5-srpm-macros-5.9.1-2.fc27.noarch 1501271392 492 1481b909b1bb55b6f9d40249c4dd026a installed
perl-srpm-macros-1-24.fc27.noarch 1501242108 794 7927a7625421bf42082a01ac50878b56 installed
ocaml-srpm-macros-5-2.fc27.noarch 1502193679 737 435bf1ed64efea04777f089c8b9c28c2 installed
gnat-srpm-macros-4-4.fc27.noarch 1501084430 841 94c08800f127bbb8687b550501910df4 installed
fpc-srpm-macros-1.1-3.fc27.noarch 1501062367 134 a725ca82ef13adfb5eab07776ac38243 installed
redhat-rpm-config-67-1.fc27.noarch 1501505549 99986 fb4e260771a6dba9623f98bde2a0670f installed
util-linux-2.30.2-1.fc27.x86_64 1506069459 11119252 07bcbbfa4f4d62db03659ae1bafb396d installed
which-2.21-4.fc27.x86_64 1501903840 77365 9c8d9a64ba5a9b3e2ce0e6339c92b466 installed
perl-Exporter-5.72-395.fc27.noarch 1501225704 55665 25a68da5ec28f81b471c85a1310d58cf installed
perl-Carp-1.42-394.fc27.noarch 1501220863 41496 ff4c644a2336c5a40306e126e77933ce installed
xorg-x11-proto-devel-7.7-23.fc27.noarch 1501241255 1511991 560aeec9b93ddf2d5d692fc7b26f9f37 installed
freetype-2.8-6.fc27.x86_64 1507551554 781753 5b8fcf6b37ec33b6031d83b36385addb installed
perl-Text-ParseWords-3.30-394.fc27.noarch 1501239718 13069 326ca776c1bf4059cc6375bc7a64c908 installed
libICE-1.0.9-11.fc27.x86_64 1501776285 155053 4f535c035c6149755bcc53f27218717d installed
lcms2-2.8-5.fc27.x86_64 1501771862 378729 711fdff3fbc715258aff068d048598c5 installed
libglvnd-1:0.2.999-24.20170818git8d4d03f.fc27.x86_64 1503478479 666120 1274707df73d450e3dbcca71bbb37294 installed
cups-libs-1:2.2.4-6.fc27.x86_64 1507126857 911732 780e64dbcab2c9e5647978437b648319 installed
python2-libs-2.7.13-17.fc27.x86_64 1502889863 26176109 04d27d06a97bd421e6041b5d0bb94d3d installed
python2-setuptools-36.2.0-7.fc27.noarch 1503217307 2340736 11ec7389395438950d6d30f47f0fa504 installed
libICE-devel-1.0.9-11.fc27.x86_64 1501776285 267826 d793a44f6cb89961c61342b5bd222b57 installed
perl-Term-ANSIColor-4.06-395.fc27.noarch 1501238192 89593 f0a7e3f74a4f837db3c715e3029c683b installed
urw-base35-fonts-common-20170801-2.fc27.noarch 1506422416 38217 3399dd5b642751c4e11089b23e68dcc6 installed
psmisc-23.1-2.fc27.x86_64 1501847857 476586 49cd87f6f8be9df6c74494175c4113fb installed
libmng-2.0.3-6.fc27.x86_64 1501786640 546264 0bc3fb21a95a277357e57187abb26094 installed
libuuid-devel-2.30.2-1.fc27.x86_64 1506069459 17233 d969eac9184638e8d644e49780a2dea4 installed
libwayland-client-1.14.0-1.fc27.x86_64 1502265038 63284 fd851320d139a1dfa3e7dc482a9d2d9b installed
poppler-data-0.4.8-1.fc27.noarch 1502742612 12070608 6e30b7d3e9fcee07284b63d09a400ddc installed
libXau-1.0.8-9.fc27.x86_64 1501776612 55201 dba0a623732d390742764cac3e4f28a5 installed
libuser-0.62-9.fc27.x86_64 1502294892 1883182 aa89cc22969b4095e7fc0c991fd26658 installed
libcroco-0.6.12-3.fc27.x86_64 1501782090 323947 7e3d9b916d0286686c333423409793c9 installed
libxshmfence-1.2-6.fc27.x86_64 1501794924 11000 72b11e359f97ff0b1d7ceb3106a98ec4 installed
atk-2.26.0-1.fc27.x86_64 1505129245 1268796 a26e2fe4769af3e0fab0ccd40faf365a installed
alsa-lib-1.1.4.1-3.fc27.x86_64 1501695945 1417499 efb69be755508a8a01d315b3c69ef585 installed
lttng-ust-2.10.0-2.fc27.x86_64 1503036197 1059415 6a073487a9ab40c5616b3956e8f24eca installed
librados-devel-1:12.2.1-1.fc27.x86_64 1506771159 318160 babbeda3767e34c83c58bf1d0359c5da installed
tcp_wrappers-libs-7.6-87.fc27.x86_64 1501891750 134773 fe18c6fb902a5dfbad8d26bb82113180 installed
libcephfs2-1:12.2.1-1.fc27.x86_64 1506771159 1163320 5cce4ff2c3115f3aa4fbb0ea50a0282b installed
librbd1-1:12.2.1-1.fc27.x86_64 1506771159 3939216 c3e5fa4bb9091ee41a394beae0ca3091 installed
libidn-1.33-4.fc27.x86_64 1501785568 684280 1da7c0db9da31811dab722140295a63e installed
xdg-utils-1.1.2-2.fc27.noarch 1501233669 317376 2cc38eb0f52b2dea5108c8c8c138346e installed
gettext-0.19.8.1-11.fc27.x86_64 1501724800 5054957 bd4765b6351525f612959ffc9d15be18 installed
util-linux-user-2.30.2-1.fc27.x86_64 1506069459 55429 7fea7c7cf1643d75f9a76dbc886e97ae installed
libxcb-devel-1.12-5.fc27.x86_64 1501794767 2686571 a924d05e57b77b4dd40adc776a9c24c8 installed
xorg-x11-font-utils-1:7.5-35.fc27.x86_64 1501911484 326756 b94fdd00da156b0f10a101ffffc8626a installed
liberation-mono-fonts-1:1.07.4-9.fc27.noarch 1501128798 458849 55c7da2b569924c9646075691ac6502e installed
python2-gluster-3.12.1-2.fc27.x86_64 1506614247 16711 ea5f24f87e5139aa478f5b351ce18073 installed
pyxattr-0.5.3-12.fc27.x86_64 1501861075 64039 a62e35b4c0b9f4c42f9b6cd4c7945867 installed
cups-client-1:2.2.4-6.fc27.x86_64 1507126857 156069 b802a7444943eb4803e9a1b2f18c46c5 installed
libglvnd-opengl-1:0.2.999-24.20170818git8d4d03f.fc27.x86_64 1503478479 193096 1dd1d89a2b4381d6d3065ee047090fdd installed
jasper-libs-2.0.14-1.fc27.x86_64 1505460176 361506 3235d935b27f2ab9e9f118f01fe77f82 installed
perl-Socket-4:2.024-5.fc27.x86_64 1501842831 118143 85e4e8647f257c82ddc540486f083465 installed
dbus-1:1.11.20-1.fc27.x86_64 1507105604 619645 89fadd8d6f55d9bc95d958dae80469d4 installed
libdrm-2.4.83-1.fc27.x86_64 1503858995 358750 cc837785f5845cc3fd1d893b88dc3bea installed
mesa-libGL-17.2.2-4.fc27.x86_64 1507745471 487648 fc38175e98c70228210f90e624870557 installed
qt-x11-1:4.8.7-31.fc27.x86_64 1501864450 36265272 b68bfac5135c91ad482468ddc7e4d936 installed
glusterfs-api-3.12.1-2.fc27.x86_64 1506614247 182440 c0dcb499a22ee01953fbb8115c497011 installed
cronie-1.5.1-8.fc27.x86_64 1501702337 246035 cfb1b64ddc14439648339451e4ced27a installed
lvm2-libs-2.02.173-4.fc27.x86_64 1501805211 3670452 2a6f0e7da43715a38a2ec7a8a1ff2144 installed
mesa-libgbm-17.2.2-4.fc27.x86_64 1507745471 57912 f33787852baeb22bdc5ace8e93e6e90e installed
mesa-libEGL-17.2.2-4.fc27.x86_64 1507745471 242801 05d97ecb3d06b9a335c8a335fc52e457 installed
libglvnd-devel-1:0.2.999-24.20170818git8d4d03f.fc27.x86_64 1503478479 0 fa7627c416c97da2c42506a83dc0f68b installed
mesa-libGL-devel-17.2.2-4.fc27.x86_64 1507745471 1595353 e81e12fc3c5274f39d9902ebb3ed34d6 installed
glusterfs-fuse-3.12.1-2.fc27.x86_64 1506614247 351364 bd3acff1e2f86fae0023a0f12d742183 installed
glusterfs-server-3.12.1-2.fc27.x86_64 1506614247 4239444 023f632e13f2226ed799fb8a574d7f11 installed
redhat-lsb-core-4.1-36.fc27.x86_64 1501864940 45646 9022380c3618dc3ee128fb619150d922 installed
redhat-lsb-desktop-4.1-36.fc27.x86_64 1501864940 0 ec6b3cfe17a0160c8b01eb5d85848235 installed
cups-filters-1.16.1-2.fc27.x86_64 1507290775 2305251 4dc872de4c5f69215062798b0b680985 installed
sqlite-3.20.1-1.fc27.x86_64 1504076536 1170364 53f411b53f0ec647fd555e1642e3bfd9 installed
glusterfs-devel-3.12.1-2.fc27.x86_64 1506614247 876473 51e720619c4664a93ad290883bb1b35c installed
python2-rpm-macros-3-22.fc27.noarch 1502799812 1495 696c018cbd8be3eed0ae0dc9ba3719f8 installed
postgresql-libs-9.6.5-1.fc27.x86_64 1504520267 740615 bbe8767ac4bd177a8f041c0035f766ca installed
lzo-2.08-11.fc27.x86_64 1501806340 170093 e6c7fd7776f1231338dd509912eb7327 installed
ncurses-devel-6.0-13.20170722.fc27.x86_64 1501818044 825315 26e81fb8e9aacb70cd62ae3201cca9cf installed
libcmocka-1.1.1-7.fc27.x86_64 1501700717 56297 50a21796a57fbb8e156d280477be1229 installed
jansson-devel-2.10-4.fc27.x86_64 1501755313 11827 1b1b51ef2282dbeb8506429abd1d5daf installed
libdmtx-devel-0.7.4-3.fc27.x86_64 1501783467 24903 1d9bbb63d37a6b990403ad71e3ccd89a installed
lzo-devel-2.08-11.fc27.x86_64 1501806340 205212 16f4e553581d556dae4e43332041f985 installed
python2-devel-2.7.13-17.fc27.x86_64 1502889863 1132551 c84577419e3b946b14015e9a1417ba8d installed
redhat-lsb-4.1-36.fc27.x86_64 1501864940 0 fb016b9edb973fb2fbf7a0fcf400005d installed
mariadb-devel-3:10.2.9-3.fc27.x86_64 1507259858 4618143 2bb525dce4675147c7baa7697920ab1e installed
librbd-devel-1:12.2.1-1.fc27.x86_64 1506771159 56880 ab2ea2c5ebfc01a2f1cae58121f3590b installed
libcephfs-devel-1:12.2.1-1.fc27.x86_64 1506771159 64812 b608f31db1be562e8a7823eb045efce0 installed
libcap-devel-2.25-7.fc27.x86_64 1501781733 15533 6604f97e8283443314e8928d1ff5cb58 installed
logrotate-3.12.3-3.fc27.x86_64 1501799624 125512 958f03f53842da2ff3a87a329c842c9d installed
gdk-pixbuf2-2.36.11-1.fc27.x86_64 1507322116 2587471 d5d2b7da3bff7753e4c728aab1272589 installed
libverto-devel-0.2.6-11.fc27.x86_64 1502119116 26046 e9b69b0733f130756c5b1b446e505687 installed
libselinux-devel-2.7-2.fc27.x86_64 1504250941 199622 d7477bc2d0af6636795cb1731fa28bb0 installed
keyutils-libs-devel-1.5.10-3.fc27.x86_64 1501759424 33454 9f43a36b5b0718e92be384c1a0460456 installed
libacl-devel-2.2.52-18.fc27.x86_64 1501695337 60283 943a8b62dab2c38ddc19c815f8f33d82 installed
libglvnd-core-devel-1:0.2.999-24.20170818git8d4d03f.fc27.x86_64 1503478479 41192 f1507437ddd7a04f4d303c0c22d2dc9a installed
mcpp-2.7.2-19.fc27.x86_64 1501808594 51674 164ffd2d7a90f81cbb1b5296f1514d82 installed
cups-filesystem-1:2.2.4-6.fc27.noarch 1507126857 0 93ad9244316f7ad4ae0a642955374fbc installed
perl-IO-Socket-SSL-2.051-1.fc27.noarch 1504625264 575447 089641a2313fc35c0c9df7a850f1f958 installed
mailcap-2.1.48-2.fc27.noarch 1501147984 72931 08d96a4c0ab64a9b9a7693b3a287799f installed
perl-HTTP-Message-6.13-2.fc27.noarch 1501228008 193798 82131037a27d9ba0a4ae20df9d7f2f51 installed
perl-CGI-4.36-4.fc27.noarch 1501219731 550824 0b363d681f0f79443cfc99976dad39d9 installed
perl-HTTP-Negotiate-6.01-18.fc27.noarch 1501227867 28534 c59c0988f0d00fbe61bac0aa15ce0c62 installed
perl-XML-SAX-0.99-20.fc27.noarch 1501241274 123924 7589a2457d05f31cf00c9a277c803029 installed
procps-ng-3.3.10-15.fc27.x86_64 1501847091 894511 3c65a8fb791be2e1039f29b2c704ab16 installed
krb5-devel-1.15.2-2.fc27.x86_64 1506704248 1074964 c8017d4681476baf0ac5c450a7f093fc installed
hwdata-0.305-1.fc27.noarch 1506929705 7113651 8cbe422ba93a31e1459b6af9a215ef6e installed
libdatrie-0.2.9-6.fc27.x86_64 1501783055 55023 c51f5c5eb19ba933ed4c1c4ad3a88c09 installed
graphite2-1.3.10-3.fc27.x86_64 1501748693 245500 5781f5b8ea3a83fcf14d608c4681104d installed
hicolor-icon-theme-0.17-1.fc27.noarch 1504186231 73932 e8ef85a5097e1467a5b3f31dea333cdf installed
libpipeline-1.4.2-3.fc27.x86_64 1501789009 108150 c8b1e39c454306e942fa920b95ac65be installed
man-db-2.7.6.1-5.fc27.x86_64 1501807116 1992361 21f4b785691bddae8b4ca2565751e297 installed
libtiff-4.0.8-3.fc27.x86_64 1501791745 502825 ca1f7b61a8a3218626fadde8b06c302c installed
gdk-pixbuf2-modules-2.36.11-1.fc27.x86_64 1507322116 253376 bb1fa30fe0133a75fa2058649dcafc1e installed
libX11-common-1.6.5-4.fc27.noarch 1501615597 1338652 d3dadd1e28fa09a34c037373b12fcaff installed
libXext-1.3.3-7.fc27.x86_64 1501777052 86590 8b8302cb10ecaa7efa6da19f3895f0fd installed
libXrender-0.9.10-4.fc27.x86_64 1501777525 42483 ca6d051be32f53540c5ae99c833400ab installed
libXi-1.7.9-4.fc27.x86_64 1501777089 73747 acfd989d65b6eac2a665b1098c191801 installed
libXcursor-1.1.14-10.fc27.x86_64 1501776966 46151 3b6c00ed7a51e06d3c889f9a8d300f75 installed
libXrandr-1.5.1-4.fc27.x86_64 1501777482 48282 242a6191563cb58eff823b4443ec8070 installed
cairo-1.15.8-1.fc27.x86_64 1504176707 1764875 2ded5a6f3615abe1d4c26ee118c71fa8 installed
libXrender-devel-0.9.10-4.fc27.x86_64 1501777525 30268 85caae872961a6c2dc0fb7e4056c55b9 installed
libXdamage-1.1.4-11.fc27.x86_64 1501776808 29496 8e6e4b03225cc93859029f4ceb17dcd9 installed
pango-1.40.12-1.fc27.x86_64 1504603737 784126 2ef2f5fcb144ae375df16eeefe3be6c2 installed
libXdamage-devel-1.1.4-11.fc27.x86_64 1501776808 2563 f4d36e4155b69d0b2f8fde50155e5f1f installed
libXt-devel-1.1.5-6.fc27.x86_64 1501777543 1673824 8cc7159305f178024c77ba901b3ddf09 installed
libXft-devel-2.3.2-7.fc27.x86_64 1501777077 23609 e39923b0158f3007f08c923a0cc7115c installed
qt3-3.3.8b-71.fc27.x86_64 1501863390 11151719 d80c24b726579d8fd501500c2c62a895 installed
libXinerama-devel-1.1.3-9.fc27.x86_64 1501777104 7198 131d60c9b3ca74b8041c13637f9ca9c8 installed
libXtst-1.2.3-4.fc27.x86_64 1501777543 29634 c1cc5507c35aadbfface649fed00bb3b installed
xorg-x11-server-utils-7.7-23.fc27.x86_64 1501911327 440335 685e454695bf3b9e0c4d09209ba8fafc installed
urw-base35-c059-fonts-20170801-2.fc27.noarch 1506422416 1057405 54977ca0ab55d0510d4146891e6f56e5 installed
urw-base35-gothic-fonts-20170801-2.fc27.noarch 1506422416 878549 e409b99cd3d10c6795123c948bb838c0 installed
urw-base35-nimbus-roman-fonts-20170801-2.fc27.noarch 1506422416 1020028 fd87fdc2ee4d172e14088502d59ea8cb installed
urw-base35-nimbus-sans-narrow-fonts-20170801-2.fc27.noarch 1506422416 892073 56913ad1e6b39f6d7eed70963589bd72 installed
urw-base35-standard-symbols-ps-fonts-20170801-2.fc27.noarch 1506422416 45177 802d9e695fe67739191e758cdbeefeb3 installed
urw-base35-fonts-20170801-2.fc27.noarch 1506422416 5478 3dfd2af8aa2093d8e350a9cb1077e95e installed
libXv-1.0.11-4.fc27.x86_64 1501777591 26071 15c96ee9ed44ea60817a580d6c4939b4 installed
libXcomposite-0.4.4-11.fc27.x86_64 1501776808 35032 a7b952abe9476ea4e0a2e50b11ec1592 installed
mariadb-config-3:10.2.9-3.fc27.x86_64 1507259858 1340 7b1e842e0374ce141afe1a9b9c4495aa installed
mariadb-libs-3:10.2.9-3.fc27.x86_64 1507259858 339104 2ac1e2ad6b41cbda4203c23430373616 installed
kmod-24-3.fc27.x86_64 1501764483 214254 75b53be9f08e2209d5ea4059dd3fb364 installed
libpcap-14:1.8.1-6.fc27.x86_64 1501788871 341247 0edb56cf109f3fe51636c73362ffded7 installed
libpng12-1.2.57-4.fc27.x86_64 1501789159 453996 3cb92cedd5a33c952efa64c5b434fe3b installed
spax-1.5.3-10.fc27.x86_64 1501888056 400130 e15993f19d0edec15427e4d151387491 installed
ncurses-compat-libs-6.0-13.20170722.fc27.x86_64 1501818044 964184 6f46dd6f032361d826d48a9ec8406d91 installed
m4-1.4.18-5.fc27.x86_64 1501806590 347640 9eb2be6397d1375669c5876ed219b335 installed
ed-1.14.1-4.fc27.x86_64 1501710088 125827 e5759c3076b64791f0c1d17dc22d482e installed
qt-common-1:4.8.7-31.fc27.noarch 1501864450 0 37104f3c4712657b75cba88a1309ab1f installed
qrencode-libs-3.4.4-3.fc27.x86_64 1501862520 130405 19fc4f1f957f3dbde7f40464d355cc3a installed
kmod-libs-24-3.fc27.x86_64 1501764483 121456 b7350d968a6b358a40cd489b660a34b8 installed
device-mapper-1.02.142-4.fc27.x86_64 1501805211 329422 5a82fa178c569912703dbd71e4aad926 installed
cryptsetup-libs-1.7.5-3.fc27.x86_64 1501702681 970866 411dbaf47c958da5895a462f6879c90d installed
systemd-234-8.fc27.x86_64 1506439858 10532436 d20aaaa10ebbc62e2ece937b9a19ae47 installed
perl-constant-1.33-395.fc27.noarch 1501241640 27075 0509cab298014c8d0a6d8c2559fea0f1 installed
libgcc-7.2.1-2.fc27.x86_64 1505486876 183352 fd4822d2a24cf1e6f406e1c47fa27a28 installed
libglvnd-glx-1:0.2.999-24.20170818git8d4d03f.fc27.x86_64 1503478479 656280 510e969a65826bf5592c2fd63d1df1ad installed
perl-Unicode-Normalize-1.25-395.fc27.x86_64 1501843676 636560 c66d52c72ab5671794a0e10baa44a7d7 installed
tzdata-2017b-2.fc27.noarch 1501205063 1718053 4d4e05e6ab3ac2809c99607c218e79d1 installed
mesa-libGLU-9.0.0-13.fc27.x86_64 1501809473 445920 3f71a6b5f3231e5045aee3bfa428b848 installed
perl-PathTools-3.67-395.fc27.x86_64 1501842594 183615 af643f168ab0201ac2e97b89e721cd6f installed
setup-2.10.10-1.fc27.noarch 1504774422 720302 643b8c03e2fb780406970d2a44bdf0dc installed
device-mapper-event-1.02.142-4.fc27.x86_64 1501805211 42717 a57fc08ce2c6372751cc59298d5c6f11 installed
perl-MIME-Base64-3.15-395.fc27.x86_64 1501841546 40454 9d310d37c68046f8216c04b7680058b5 installed
glibc-all-langpacks-2.26-15.fc27.x86_64 1508593974 113057424 3b1766e4b216080533ca7c18ff9824e9 installed
libglvnd-egl-1:0.2.999-24.20170818git8d4d03f.fc27.x86_64 1503478479 79008 ed2f21d1dae6eb8b7c802887f9552a8a installed
perl-HTTP-Tiny-0.070-394.fc27.noarch 1501228130 147182 b9b9bfd4e7b1bc321e1b3fabe50b44bd installed
bash-4.4.12-11.fc27.x86_64 1504089541 6843227 4d5f580f30cfd9417ea230b558427704 installed
libdrm-devel-2.4.83-1.fc27.x86_64 1503858995 488846 94b3d5b074eb025af3250f7f086bb615 installed
perl-IO-Socket-IP-0.39-4.fc27.noarch 1501228460 99496 cb401cc8ad095885f0c9c826fc2dbe40 installed
libselinux-2.7-2.fc27.x86_64 1504250941 224944 6793d42edcfe0e772b67d41099ad4baa installed
rpcbind-0.2.4-8.rc2.fc27.x86_64 1504711708 105297 27a5981d456fa4576012d6731ca0e728 installed
perl-Digest-1.17-394.fc27.noarch 1501224878 26596 b0621e9270d48350dec074a5c287a7c5 installed
xz-libs-5.2.3-4.fc27.x86_64 1501913031 159526 cfe562ab235fe8d4d9e3eff93910b022 installed
redhat-lsb-cxx-4.1-36.fc27.x86_64 1501864940 0 4878809dec51b0a477595a7177d78184 installed
perl-Params-Check-1:0.38-394.fc27.noarch 1501234446 28427 edf949f75db578e4b2c7007db1a222b2 installed
popt-1.16-12.fc27.x86_64 1507845537 125766 7a66a05eb8fac6fda4235f191fe67c59 installed
redhat-lsb-printing-4.1-36.fc27.x86_64 1501864940 0 c48c0336559b18557db3d371654da779 installed
perl-Sub-Install-0.928-13.fc27.noarch 1501237407 35779 5cd8dcc2cfa72b2b99b10fe2707ec594 installed
nspr-4.17.0-1.fc27.x86_64 1505897103 304310 f7e7c3d7a78031cad74b72ba002dfe70 installed
python3-rpm-generators-4.14.0-0.rc1.1.fc27.noarch 1505749599 60676 1e3f0de3fcb5fb386831341f69d23e88 installed
perl-Net-Ping-0:2.55-401.fc27.noarch 1506349264 89494 fc6b61cc47d74e68f5d595ea7947ad81 installed
libuuid-2.30.2-1.fc27.x86_64 1506069459 21288 bee69e192ccae8f8ccc4b9e79ba2a908 installed
lzo-minilzo-2.08-11.fc27.x86_64 1501806340 37327 d24b9c6cd4a946449fa0221f8e97d1b9 installed
perl-Module-CoreList-1:5.20170923-1.fc27.noarch 1506333877 798390 31f3ff479eb3e206924fca4b8e6be548 installed
libunistring-0.9.7-3.fc27.x86_64 1501792476 1563722 1f9cfcf97627fa3c73d7bfb73e1f9e35 installed
libdmtx-0.7.4-3.fc27.x86_64 1501783467 116374 75dc23022c0955c0aa121aa26f655988 installed
perl-Env-1.04-394.fc27.noarch 1501225317 26846 875bb78c15906686563785f6093a8046 installed
libgpg-error-1.27-3.fc27.x86_64 1501784593 709522 53b509a6e27f417573bcd3c3d6dc52ec installed
libcmocka-devel-1.1.1-7.fc27.x86_64 1501700717 836516 9063f97f2099233f6d748dc4a20af36c installed
perl-B-Lint-1.20-10.fc27.noarch 1501219515 31117 03d4291ed005ece32f173c858e9cbc76 installed
chkconfig-1.10-3.fc27.x86_64 1501699961 782311 b9d5f7ebb2e85c845e6b2c502f4a6152 installed
postgresql-devel-9.6.5-1.fc27.x86_64 1504520267 5255902 22f11497146b01107a87d13676a819b0 installed
perl-local-lib-2.000024-1.fc27.noarch 1507815152 120121 b21b6be88d14d0f0cbac998bde51c37c installed
libcom_err-1.43.5-2.fc27.x86_64 1502453303 60017 627a72d9d7e2fca10fb7e3e776614660 installed
qt-devel-1:4.8.7-31.fc27.x86_64 1501864450 37461345 2b96c6ce741eddd19c46e376516e8318 installed
perl-IPC-System-Simple-1.25-16.fc27.noarch 1501688979 70428 0e0bfba9b307c2c98ed8714043188fea installed
libcrypt-nss-2.26-15.fc27.x86_64 1508593974 36728 065cc1df8e19b46414fab3963a9aaa9a installed
libradosstriper-devel-1:12.2.1-1.fc27.x86_64 1506771159 28600 ac7901e3a05cbd54e6be09dd1c5c8be7 installed
perl-Compress-Raw-Bzip2-2.074-396.fc27.x86_64 1501835732 57570 f48027990eef9007f803067757e0951d installed
systemd-libs-234-8.fc27.x86_64 1506439858 1334274 b8a2896cf92bf187f698e4e728e08766 installed
mtx-1.3.12-17.fc27.x86_64 1501816182 430610 86fc60a8c86f955c3dcf27f2d32412c7 installed
perl-Encode-4:2.92-14.fc27.x86_64 1501837603 10175132 201d736405ba159d6dc42c909d1b002d installed
ca-certificates-2017.2.16-4.fc27.noarch 1502804946 1166932 0ba4e6ad442537bce8a90697ebaac177 installed
perl-Pod-Usage-4:1.69-394.fc27.noarch 1501235641 49670 940d07b296d980d2da39e0be067f765d installed
zip-3.0-20.fc27.x86_64 1501917567 827493 9d86a53417c04d58a232c12bba156f8d installed
perl-ExtUtils-ParseXS-1:3.35-1.fc27.noarch 1501572757 185411 63d471a48cb8719af45d0b7915ade354 installed
libpsl-0.18.0-1.fc27.x86_64 1502431817 57316 2279ca1a0d5ae710e9044b5d0b7e77ca installed
perl-Digest-HMAC-1.03-16.fc27.noarch 1501224646 10785 8528f3d9e28b92a137b4cd40f2f5aa1a installed
patch-2.7.5-6.fc27.x86_64 1501832932 232069 441283d324b81cd72f35744f8d942dba installed
perl-IO-Zlib-1:1.10-401.fc27.noarch 1506349264 19749 cb53db58eb72129d4bcdf57b4a152df7 installed
gdbm-1.13-3.fc27.x86_64 1501722811 456585 15d6ad8ea8e112e8afe2ae9b6c32399e installed
perl-Archive-Zip-1.59-5.fc27.noarch 1501219429 258276 036f05b5663e8835a3571a9eb03209da installed
nettle-3.3-5.fc27.x86_64 1502346692 534842 1ae2f8710f83bb598c99fdb3a4cb2fdd installed
perl-Archive-Tar-2.26-4.fc27.noarch 1501219507 153839 873a38b789d210c635c82ad5fda74f8c installed
findutils-1:4.6.0-14.fc27.x86_64 1501716935 1753305 a349cf529534dcd890040d5337eefe03 installed
perl-Data-Dump-1.23-6.fc27.noarch 1501223514 50900 87ca923ac174da6eea69835d1c322d71 installed
elfutils-default-yama-scope-0.170-1.fc27.noarch 1501756032 1810 44f61862c239a990fbcb063fb447714d installed
perl-CPAN-Meta-2.150010-394.fc27.noarch 1501220492 609743 6740bb8a79fdcc75ad6b3b9581e1bcbd installed
glibc-devel-2.26-15.fc27.x86_64 1508593974 1163150 990df66e939e909086faabfa1e000717 installed
perl-File-HomeDir-1.002-3.fc27.noarch 1501226068 120687 7b1b7e90be93d7ab07e6bae20ae58eab installed
crypto-policies-20170816-1.git2618a6c.fc27.noarch 1502869404 43789 f3b405292fed384ad2bcb9d736b05d6c installed
perl-Data-Section-0.200007-2.fc27.noarch 1501223843 43033 312a495fb74782618142a854304cea83 installed
cracklib-2.9.6-7.fc27.x86_64 1501702286 210080 e3ed1a09ea6abe9014a8ed56fa73befd installed
libesmtp-1.0.6-13.fc27.x86_64 1501783834 145095 67f7e357f1d1d54a4ae3110913df4ec9 installed
python3-pip-9.0.1-11.fc27.noarch 1501264135 9374875 2fa5ddc7256da012d9fda6df02c4c7eb installed
pcre-cpp-8.41-1.fc27.2.x86_64 1501833619 35944 ba328b2f925630c435e6de5033be17cd installed
gcc-7.2.1-2.fc27.x86_64 1505486876 53779810 2d18ef6371d916ee87cbc798ff2d49eb installed
perl-devel-4:5.26.1-401.fc27.x86_64 1506349264 3531453 ad7f2aa0b300bc528ac4637e83ba5419 installed
gnutls-3.5.15-1.fc27.x86_64 1503311250 2359211 f0103f7fb502d1d51d6e8cc47097153b installed
perl-inc-latest-2:0.500-8.fc27.noarch 1501241811 35793 e936b3da3b44f47295b55d4c53849490 installed
nss-3.33.0-1.0.fc27.x86_64 1507040923 2476266 367cc894dae411123f7b3252af85e59c installed
expat-devel-2.2.4-1.fc27.x86_64 1503303308 158993 190e126c3fb630eec35b232d530ee9a9 installed
libsmartcols-2.30.2-1.fc27.x86_64 1506069459 222258 f08802d19f16df450d71020ab50fb2f3 installed
shared-mime-info-1.9-1.fc27.x86_64 1505735007 2440339 75f423d1b703173a64666022f6471c4f installed
gc-7.6.0-7.fc27.x86_64 1501722497 222653 bc44cebbb3456a4a574f0de54148cc17 installed
libsepol-devel-2.7-1.fc27.x86_64 1502122692 129729 d4089aa559bc74a740fb3af209bd2929 installed
compat-openssl10-1:1.0.2j-9.fc27.x86_64 1503315023 2990609 59f919927b8ab1d03a22c501f315b8ae installed
libattr-devel-2.4.47-21.fc27.x86_64 1501697288 23497 21f3d6940278fbe9e028169966503501 installed
npth-1.5-3.fc27.x86_64 1501821656 46141 69a2747d7623fecf6eaf9536cddee5f9 installed
libmcpp-2.7.2-19.fc27.x86_64 1501808594 145852 7f9942cde5665608c065cd8fc36effaf installed
openldap-2.4.45-3.fc27.x86_64 1501828069 1018717 4f7e521154abed8349022a59ba58e789 installed
openssl-1:1.1.0f-9.fc27.x86_64 1501829154 879125 d0cffda53caf798c90a7bfc10b987a4f installed
pkgconf-pkg-config-1.3.9-1.fc27.x86_64 1505890594 2604 024f1de370347f44042f625a6db60a53 installed
perl-LWP-MediaTypes-6.02-13.fc27.noarch 1501229404 62134 5bcb4a9a555bcd39c29e8708cbf1e6bb installed
rpm-plugin-selinux-4.14.0-2.fc27.x86_64 1507817895 11176 982d2201f46adf90fa6f794ce44035af installed
perl-HTTP-Cookies-6.04-1.fc27.noarch 1502451795 69929 37d362e8ee1c6e9b62b8f7e238234c2d installed
rust-srpm-macros-4-3.fc27.noarch 1501183954 1131 fdbaa597d6128f1a3ead37a866828e5a installed
perl-XML-LibXML-1:2.0129-8.fc27.x86_64 1506324607 986946 41d26c61545ee1e6a26f2a891f51fa13 installed
openblas-srpm-macros-2-2.fc27.noarch 1501211711 104 17f4a41a0d51dc0dfd22fd28bfafa1b2 installed
openssl-devel-1:1.1.0f-9.fc27.x86_64 1501829154 3063085 1a46e5670a5444c07b8f26d1f208a65e installed
ghc-srpm-macros-1.4.2-6.fc27.noarch 1501078005 414 ffbaf19102ddad126993e045fa94dc77 installed
libthai-0.1.25-4.fc27.x86_64 1501791653 757685 9b0d27dca83967b4b1e4d00c73f9fc11 installed
rpm-build-4.14.0-2.fc27.x86_64 1507817895 281543 f1b583cecb0cbff78e2a07f423735edf installed
pixman-0.34.0-4.fc27.x86_64 1501248884 683503 e88af04c912576804f1cde2a3a6e46cf installed
ccache-3.3.4-3.fc27.x86_64 1501699767 502689 338b8a0aeef1e6687e7a639cbcc1aae0 installed
jbigkit-libs-2.1-8.fc27.x86_64 1501755528 107421 3b4364cbf395f0c6212bafd7aa8edf21 installed
perl-Scalar-List-Utils-3:1.48-1.fc27.x86_64 1498470035 123369 db32a24afee720650b1bfa6c82bf3d17 installed
cups-filters-libs-1.16.1-2.fc27.x86_64 1507290775 258429 c6e2941efded462be723a20823a10b45 installed
libjpeg-turbo-1.5.1-4.fc27.x86_64 1501785604 508819 37a10c4a017b5b4ffb57d04e5f050598 installed
libX11-devel-1.6.5-4.fc27.x86_64 1501615597 1100103 a5ce5f7d9068fa17f1e8f0329667ae58 installed
libSM-1.2.2-7.fc27.x86_64 1501776304 81194 151a33d2343628ac98016c237433cf6b installed
libXfixes-5.0.3-4.fc27.x86_64 1501777043 26623 9fd20a0fd7448cf07d5c81ab5a06e3e2 installed
avahi-libs-0.7-3.fc27.x86_64 1501697677 149184 3878734993b1da80550b68837c179eb4 installed
libXinerama-1.1.3-9.fc27.x86_64 1501777104 14759 e8f22c15d187ee449820790218f4eeb1 installed
python2-pip-9.0.1-11.fc27.noarch 1501264135 8048630 3ad22993265ed8a04337c15b95860586 installed
libXt-1.1.5-6.fc27.x86_64 1501777543 434681 77c53e6e089e2cbd4a75e4a9e9e01656 installed
glusterfs-client-xlators-3.12.1-2.fc27.x86_64 1506614247 4238608 8d8f7ca8e18f35e3794f6a09225e13f6 installed
libXxf86vm-devel-1.1.4-6.fc27.x86_64 1501777760 12355 61c37eb44ecda8cebfd3dcb5e36af2f1 installed
libX11-xcb-1.6.5-4.fc27.x86_64 1501615597 6680 5f2d5f7e110e9648c2c1ea2fa00ecbf5 installed
libXcursor-devel-1.1.14-10.fc27.x86_64 1501776966 18757 7b119c8162ff92df642ebeb54af8b97f installed
perl-Perl-OSType-1.010-395.fc27.noarch 1501234905 33805 2a5b9baea94e389921c5fd14e236ea76 installed
poppler-utils-0.57.0-2.fc27.x86_64 1506334109 524192 79abd0313aa34c134460b77a157d5edf installed
libfontenc-1.1.3-6.fc27.x86_64 1501784344 55669 c8de59e4e922f8081c55db5f5ee20835 installed
libXxf86misc-1.0.3-14.fc27.x86_64 1501777686 29452 80465449f6e1b5bf06c2692333751fe5 installed
libxcb-1.12-5.fc27.x86_64 1501794767 988360 45405c32f42341e6b6dc4b595e3daab3 installed
urw-base35-d050000l-fonts-20170801-2.fc27.noarch 1506422416 56733 f37805db052942c7677fd0b9cb0fafb1 installed
mesa-libglapi-17.2.2-4.fc27.x86_64 1507745471 199744 48dc1fb104b2f54e8d3abd9a8073095e installed
urw-base35-nimbus-sans-fonts-20170801-2.fc27.noarch 1506422416 902569 24549514eded2b00d65636d75e27e60d installed
bc-1.07.1-3.fc27.x86_64 1501697803 230722 10d07a070e79f7c4ead918796b20b457 installed
urw-base35-z003-fonts-20170801-2.fc27.noarch 1506422416 286029 92f9f335ec16e97e35d87204df84c5bf installed
librados2-1:12.2.1-1.fc27.x86_64 1506771159 11525408 2a8397370ad61df1297328cf4b93fc0d installed
libXv-devel-1.0.11-4.fc27.x86_64 1501777591 42230 ec38d9c9377cc23352cccf4cc8423700 installed
device-mapper-persistent-data-0.7.0-0.6.rc6.fc27.x86_64 1501704838 1325655 8149f6f53f09ac6c4de5ab293f44db24 installed
mariadb-common-3:10.2.9-3.fc27.x86_64 1507259858 201184 83af9ddfa11aa52a03d7cf90c4004535 installed
redhat-lsb-submod-multimedia-4.1-36.fc27.x86_64 1501864940 0 933bb8d29b160b9cbfa8d66e05985e1b installed
attr-2.4.47-21.fc27.x86_64 1501697288 157860 abf568c9b4d29e748d9be9d3bbc045e2 installed
gettext-libs-0.19.8.1-11.fc27.x86_64 1501724800 946272 44e1e596502f054c58b23fac5650f2fa installed
time-1.7-54.fc27.x86_64 1501893227 51843 4068f7cbfc85347bc43c462511fb9297 installed
libXau-devel-1.0.8-9.fc27.x86_64 1501776612 6519 f6034978d3dd8b9e41a4c889a80cbc24 installed
mailx-12.5-23.fc27.x86_64 1506089341 489605 1f6f67af0231d4c0e6f0e50d16c9d297 installed
liberation-fonts-common-1:1.07.4-9.fc27.noarch 1501128798 76499 64ea645c6ff47602f4e8ef5baa8924a4 installed
qt-settings-27-1.fc27.noarch 1505980403 1164 6b97fcc5d9c7888ca6e012040679e6e0 installed
glusterfs-extra-xlators-3.12.1-2.fc27.x86_64 1506614247 313513 98749c85247eec7d19ef12bb134239ea installed
libseccomp-2.3.2-5.fc27.x86_64 1501790638 305308 8db6f7ade98cc2da8212e6d1de22bb09 installed
avahi-glib-0.7-3.fc27.x86_64 1501697677 15400 73209a1aa73ad2c8087650540134c9a8 installed
device-mapper-libs-1.02.142-4.fc27.x86_64 1501805211 404119 8106788b4f3c395a8c954027d3de35a8 installed
perl-macros-4:5.26.1-401.fc27.x86_64 1506349264 5342 8624c5daef4c5c9924e412b1c90fb322 installed
installed_pkgs.log (54,767 bytes)   
tuxmaster

tuxmaster

2017-11-04 17:46

reporter  

root.log (391,677 bytes)
joergs

joergs

2018-04-05 18:25

developer   ~0002969

Yes. CEPH API has changed in newer versions. Not sure, when we find time to address this.

Related Changesets

bareos: bareos-17.2 fd7b5db7

2018-05-11 15:15:08

pstorz

Ported: N/A

Details Diff
backport ceph: ported cephfs-fd and cephfs_device to new api

We now use the ceph_statx family of functions if ceph/ceph_statx.h
exists. Otherwise we use the old API.
Affected Issues
0000872
mod - autoconf/config.h.in Diff File
mod - autoconf/configure.in Diff File
mod - configure Diff File
mod - src/plugins/filed/cephfs-fd.c Diff File
mod - src/stored/backends/cephfs_device.c Diff File

Issue History

Date Modified Username Field Change
2017-11-04 17:46 tuxmaster New Issue
2017-11-04 17:46 tuxmaster File Added: build.log
2017-11-04 17:46 tuxmaster File Added: installed_pkgs.log
2017-11-04 17:46 tuxmaster File Added: root.log
2018-04-05 18:25 joergs Note Added: 0002969
2018-04-05 18:25 joergs Status new => confirmed
2018-06-08 13:42 joergs Relationship added child of 0000916
2018-06-08 13:44 joergs Changeset attached => bareos bareos-17.2 fd7b5db7
2018-06-08 13:45 joergs bareos-master: impact => yes
2018-06-08 13:45 joergs bareos-master: action => fixed
2018-06-08 13:45 joergs bareos-17.2: impact => yes
2018-06-08 13:45 joergs bareos-17.2: action => fixed
2018-06-08 13:45 joergs Status confirmed => resolved
2018-06-08 13:45 joergs Resolution open => fixed
2018-06-08 13:45 joergs Assigned To => joergs
2018-06-22 17:13 joergs Assigned To joergs =>
2018-06-22 17:13 joergs Status resolved => closed
2018-06-22 17:13 joergs Fixed in Version => 17.2.6